BDBM22428 4-[(1Z)-5-azido-1-{4-[2-(dimethylamino)ethoxy]phenyl}-2-phenylpent-1-en-1-yl]phenol::4-hydroxytamoxifen (4-OHT) analog, 8
SMILES: CN(C)CCOc1ccc(cc1)C(=C(\CCCN=[N+]=[N-])c1ccccc1)\c1ccc(O)cc1
InChI Key: InChIKey=JTJSLKFUDOMDOL-RQZHXJHFSA-N
Data: 2 IC50
Activity Spreadsheet -- Enzyme Inhibition Constant Data from BindingDB
Found 2 hits for monomerid = 22428
Trg + Lig
Ki
nM
ΔG°
kcal/mole
IC50
nM
Kd
nM
EC50/IC50
nM
koff
s-1
kon
M-1s-1
pHTemp
°C
Estrogen-Related Receptor, gamma
(Homo sapiens (Human))
BDBM22428
(4-[(1Z)-5-azido-1-{4-[2-(dimethylamino)ethoxy]phen...)
Show SMILES CN(C)CCOc1ccc(cc1)C(=C(\CCCN=[N+]=[N-])c1ccccc1)\c1ccc(O)cc1
Show InChI InChI=1S/C27H30N4O2/c1-31(2)19-20-33-25-16-12-23(13-17-25)27(22-10-14-24(32)15-11-22)26(9-6-18-29-30-28)21-7-4-3-5-8-21/h3-5,7-8,10-17,32H,6,9,18-20H2,1-2H3/b27-26-
Reactome pathway
n/an/a 160n/an/an/an/a7.422
GSK
Assay Description
Binding affinity was measured by a scintillation proximity binding assay using [3H]4-OHT (for ERRgamma) or [3H]estradiol (for ERalpha) as radioligand...
Bioorg Med Chem Lett 16: 821-4 (2006)
Article DOI: 10.1016/j.bmcl.2005.11.030
BindingDB Entry DOI: 10.7270/Q2WW7FZ7
3D
3D Structure (docked)
Estrogen receptor
(Homo sapiens (Human))
BDBM22428
(4-[(1Z)-5-azido-1-{4-[2-(dimethylamino)ethoxy]phen...)
Show SMILES CN(C)CCOc1ccc(cc1)C(=C(\CCCN=[N+]=[N-])c1ccccc1)\c1ccc(O)cc1
Show InChI InChI=1S/C27H30N4O2/c1-31(2)19-20-33-25-16-12-23(13-17-25)27(22-10-14-24(32)15-11-22)26(9-6-18-29-30-28)21-7-4-3-5-8-21/h3-5,7-8,10-17,32H,6,9,18-20H2,1-2H3/b27-26-
n/an/a 13n/an/an/an/a7.422
GSK
Assay Description
Binding affinity was measured by a scintillation proximity binding assay using [3H]4-OHT (for ERRgamma) or [3H]estradiol (for ERalpha) as radioligand...
Bioorg Med Chem Lett 16: 821-4 (2006)
Article DOI: 10.1016/j.bmcl.2005.11.030
BindingDB Entry DOI: 10.7270/Q2WW7FZ7