BDBM22434 4-[(1Z)-1-{4-[2-(dimethylamino)ethoxy]phenyl}-4-hydroxy-2-phenylbut-1-en-1-yl]phenol::4-hydroxytamoxifen (4-OHT) analog, 14
SMILES: CN(C)CCOc1ccc(cc1)C(=C(\CCO)c1ccccc1)\c1ccc(O)cc1
InChI Key: InChIKey=MZLLOCKOYWOFPI-QPLCGJKRSA-N
Data: 2 IC50
Activity Spreadsheet -- Enzyme Inhibition Constant Data from BindingDB
Found 2 hits for monomerid = 22434
Trg + Lig
Ki
nM
ΔG°
kcal/mole
IC50
nM
Kd
nM
EC50/IC50
nM
koff
s-1
kon
M-1s-1
pHTemp
°C
Estrogen-Related Receptor, gamma
(Homo sapiens (Human))
BDBM22434
(4-[(1Z)-1-{4-[2-(dimethylamino)ethoxy]phenyl}-4-hy...)
Show SMILES CN(C)CCOc1ccc(cc1)C(=C(\CCO)c1ccccc1)\c1ccc(O)cc1
Show InChI InChI=1S/C26H29NO3/c1-27(2)17-19-30-24-14-10-22(11-15-24)26(21-8-12-23(29)13-9-21)25(16-18-28)20-6-4-3-5-7-20/h3-15,28-29H,16-19H2,1-2H3/b26-25-
Reactome pathway
n/an/a 250n/an/an/an/a7.422
GSK
Assay Description
Binding affinity was measured by a scintillation proximity binding assay using [3H]4-OHT (for ERRgamma) or [3H]estradiol (for ERalpha) as radioligand...
Bioorg Med Chem Lett 16: 821-4 (2006)
Article DOI: 10.1016/j.bmcl.2005.11.030
BindingDB Entry DOI: 10.7270/Q2WW7FZ7
3D
3D Structure (docked)
Estrogen receptor
(Homo sapiens (Human))
BDBM22434
(4-[(1Z)-1-{4-[2-(dimethylamino)ethoxy]phenyl}-4-hy...)
Show SMILES CN(C)CCOc1ccc(cc1)C(=C(\CCO)c1ccccc1)\c1ccc(O)cc1
Show InChI InChI=1S/C26H29NO3/c1-27(2)17-19-30-24-14-10-22(11-15-24)26(21-8-12-23(29)13-9-21)25(16-18-28)20-6-4-3-5-7-20/h3-15,28-29H,16-19H2,1-2H3/b26-25-
n/an/a 250n/an/an/an/a7.422
GSK
Assay Description
Binding affinity was measured by a scintillation proximity binding assay using [3H]4-OHT (for ERRgamma) or [3H]estradiol (for ERalpha) as radioligand...
Bioorg Med Chem Lett 16: 821-4 (2006)
Article DOI: 10.1016/j.bmcl.2005.11.030
BindingDB Entry DOI: 10.7270/Q2WW7FZ7