BDBM224835 US9321756, 94
SMILES: Nc1nnc(o1)-c1ccc2[nH]cc(-c3nccc(n3)C3CC3)c2c1
InChI Key: InChIKey=OXNIZFDZFYTTAF-UHFFFAOYSA-N
Data: 3 IC50
Activity Spreadsheet -- Enzyme Inhibition Constant Data from BindingDB
Found 3 hits for monomerid = 224835
Trg + Lig
Ki
nM
ΔG°
kcal/mole
IC50
nM
Kd
nM
EC50/IC50
nM
koff
s-1
kon
M-1s-1
pHTemp
°C
Serine/threonine-protein kinase pim-3
(Homo sapiens (Human))
BDBM224835
(US9321756, 94)
Show SMILES Nc1nnc(o1)-c1ccc2[nH]cc(-c3nccc(n3)C3CC3)c2c1
Show InChI InChI=1S/C17H14N6O/c18-17-23-22-16(24-17)10-3-4-14-11(7-10)12(8-20-14)15-19-6-5-13(21-15)9-1-2-9/h3-9,20H,1-2H2,(H2,18,23)
US Patent
n/an/a 0.998n/an/an/an/an/an/a
AMGEN INC.
US Patent
Assay Description
The assay for the determination of Pim activity is based on the formation of phosphorylated biotinylated-BAD peptide at the Serine 112 residue (S112)...
US Patent US9321756 (2016)
BindingDB Entry DOI: 10.7270/Q2W094S2
Serine/threonine-protein kinase pim-2
(Homo sapiens (Human))
BDBM224835
(US9321756, 94)
Show SMILES Nc1nnc(o1)-c1ccc2[nH]cc(-c3nccc(n3)C3CC3)c2c1
Show InChI InChI=1S/C17H14N6O/c18-17-23-22-16(24-17)10-3-4-14-11(7-10)12(8-20-14)15-19-6-5-13(21-15)9-1-2-9/h3-9,20H,1-2H2,(H2,18,23)
US Patent
n/an/a 0.984n/an/an/an/an/an/a
AMGEN INC.
US Patent
Assay Description
The assay for the determination of Pim activity is based on the formation of phosphorylated biotinylated-BAD peptide at the Serine 112 residue (S112)...
US Patent US9321756 (2016)
BindingDB Entry DOI: 10.7270/Q2W094S2
Serine/threonine-protein kinase pim-1
(Homo sapiens (Human))
BDBM224835
(US9321756, 94)
Show SMILES Nc1nnc(o1)-c1ccc2[nH]cc(-c3nccc(n3)C3CC3)c2c1
Show InChI InChI=1S/C17H14N6O/c18-17-23-22-16(24-17)10-3-4-14-11(7-10)12(8-20-14)15-19-6-5-13(21-15)9-1-2-9/h3-9,20H,1-2H2,(H2,18,23)
US Patent
n/an/a 5.19n/an/an/an/an/an/a
AMGEN INC.
US Patent
Assay Description
The assay for the determination of Pim activity is based on the formation of phosphorylated biotinylated-BAD peptide at the Serine 112 residue (S112)...
US Patent US9321756 (2016)
BindingDB Entry DOI: 10.7270/Q2W094S2