BDBM224873 US9321756, 128
SMILES: CNc1nnc(s1)-c1ccc2[nH]cc(-c3nccc(n3)N3CCC[C@H](N)C3)c2c1
InChI Key:
Data: 3 IC50
Activity Spreadsheet -- Enzyme Inhibition Constant Data from BindingDB
Found 3 hits for monomerid = 224873
Trg + Lig
Ki
nM
ΔG°
kcal/mole
IC50
nM
Kd
nM
EC50/IC50
nM
koff
s-1
kon
M-1s-1
pHTemp
°C
Serine/threonine-protein kinase pim-3
(Homo sapiens (Human))
BDBM224873
(US9321756, 128)
Show SMILES CNc1nnc(s1)-c1ccc2[nH]cc(-c3nccc(n3)N3CCC[C@H](N)C3)c2c1 |r|
US Patent
n/an/a 0.734n/an/an/an/an/an/a
AMGEN INC.
US Patent
Assay Description
The assay for the determination of Pim activity is based on the formation of phosphorylated biotinylated-BAD peptide at the Serine 112 residue (S112)...
US Patent US9321756 (2016)
BindingDB Entry DOI: 10.7270/Q2W094S2
Serine/threonine-protein kinase pim-2
(Homo sapiens (Human))
BDBM224873
(US9321756, 128)
Show SMILES CNc1nnc(s1)-c1ccc2[nH]cc(-c3nccc(n3)N3CCC[C@H](N)C3)c2c1 |r|
US Patent
n/an/a 1.53n/an/an/an/an/an/a
AMGEN INC.
US Patent
Assay Description
The assay for the determination of Pim activity is based on the formation of phosphorylated biotinylated-BAD peptide at the Serine 112 residue (S112)...
US Patent US9321756 (2016)
BindingDB Entry DOI: 10.7270/Q2W094S2
Serine/threonine-protein kinase pim-1
(Homo sapiens (Human))
BDBM224873
(US9321756, 128)
Show SMILES CNc1nnc(s1)-c1ccc2[nH]cc(-c3nccc(n3)N3CCC[C@H](N)C3)c2c1 |r|
US Patent
n/an/a 2.91n/an/an/an/an/an/a
AMGEN INC.
US Patent
Assay Description
The assay for the determination of Pim activity is based on the formation of phosphorylated biotinylated-BAD peptide at the Serine 112 residue (S112)...
US Patent US9321756 (2016)
BindingDB Entry DOI: 10.7270/Q2W094S2