null
SMILES: CCCCn1cc(c2ccccc12)C1(C(=O)Nc2ccccc12)c1cn(CCCC)c2ccccc12
InChI Key: InChIKey=UFFQMYUXAKOSDF-UHFFFAOYSA-N
Activity Spreadsheet -- Enzyme Inhibition Constant Data from BindingDB
Found 2 hits for monomerid = 225292
Trg + Lig
Ki
nM
ΔG°
kcal/mole
IC50
nM
Kd
nM
EC50/IC50
nM
koff
s-1
kon
M-1s-1
pHTemp
°C
Probable maltase-glucoamylase 2
(Homo sapiens)
BDBM225292
(1,1''-Dibutyl-[3,3':3',3''...)
Show SMILES CCCCn1cc(c2ccccc12)C1(C(=O)Nc2ccccc12)c1cn(CCCC)c2ccccc12
Show InChI InChI=1S/C32H33N3O/c1-3-5-19-34-21-26(23-13-7-11-17-29(23)34)32(25-15-9-10-16-28(25)33-31(32)36)27-22-35(20-6-4-2)30-18-12-8-14-24(27)30/h7-18,21-22H,3-6,19-20H2,1-2H3,(H,33,36)
n/an/a 5.90E+3n/an/an/an/an/an/a
Babasaheb Bhimrao Ambedkar University (A Central University)
Curated by ChEMBL
Assay Description
Inhibition of alpha-glucosidase (unknown origin) using p-nitrophenyl-alpha-d-glucopyranoside as substrate preincubated for 15 mins followed by substr...
Eur J Med Chem 176: 343-377 (2019)
Article DOI: 10.1016/j.ejmech.2019.04.025
Alpha-glucosidase MAL32
(Saccharomyces cerevisiae)
BDBM225292
(1,1''-Dibutyl-[3,3':3',3''...)
Show SMILES CCCCn1cc(c2ccccc12)C1(C(=O)Nc2ccccc12)c1cn(CCCC)c2ccccc12
Show InChI InChI=1S/C32H33N3O/c1-3-5-19-34-21-26(23-13-7-11-17-29(23)34)32(25-15-9-10-16-28(25)33-31(32)36)27-22-35(20-6-4-2)30-18-12-8-14-24(27)30/h7-18,21-22H,3-6,19-20H2,1-2H3,(H,33,36)
Reactome pathway
n/an/a 1.36E+4n/an/an/an/a6.837
Jishou University
Assay Description
The α-glucosidase inhibition assay had been carried out using baker's yeast α-glucosidase (EC 3.2.1.20) and p-nitrophenyl α-d-gluco...
Bioorg Chem 72: 228-233 (2017)
BindingDB Entry DOI: 10.7270/Q2DV1HSV