null
SMILES: Oc1cc(O)c(cc1Cl)-n1c2ccc(CNS(=O)(=O)c3cccc(Cl)c3Cl)cc2[nH]c1=O
InChI Key: InChIKey=ZMWUGTRQJZOUFS-UHFFFAOYSA-N
Activity Spreadsheet -- Enzyme Inhibition Constant Data from BindingDB
Found 1 hit for monomerid = 225745
Trg + Lig
Ki
nM
ΔG°
kcal/mole
IC50
nM
Kd
nM
EC50/IC50
nM
koff
s-1
kon
M-1s-1
pHTemp
°C
Heat shock protein HSP 90-beta
(Homo sapiens (Human))
BDBM225745
(hsp90_42)
Show SMILES Oc1cc(O)c(cc1Cl)-n1c2ccc(CNS(=O)(=O)c3cccc(Cl)c3Cl)cc2[nH]c1=O |(.22,-8.41,;.7,-6.94,;-.33,-5.8,;.14,-4.33,;-.89,-3.19,;1.65,-4.01,;2.68,-5.16,;2.2,-6.62,;3.23,-7.77,;2.13,-2.55,;3.59,-2.07,;4.92,-2.84,;6.26,-2.07,;6.26,-.53,;7.59,.24,;7.59,1.78,;8.92,2.55,;9.69,1.21,;8.15,3.88,;10.26,3.32,;10.26,4.86,;11.59,5.63,;12.93,4.86,;12.93,3.32,;14.26,2.55,;11.59,2.55,;11.59,1.01,;4.92,.24,;3.59,-.53,;2.13,-.06,;1.22,-1.3,;-.32,-1.3,)|
Show InChI InChI=1S/C20H14Cl3N3O5S/c21-11-2-1-3-18(19(11)23)32(30,31)24-9-10-4-5-14-13(6-10)25-20(29)26(14)15-7-12(22)16(27)8-17(15)28/h1-8,24,27-28H,9H2,(H,25,29)
Reactome pathway
D3R
n/an/a 10.8n/an/an/an/an/an/a
D3R
Assay Description
FRET Assay 1
D3R 408: (2016)
BindingDB Entry DOI: 10.7270/Q2VX0FC0