BDBM22582 324572-F::4-{3-methyl-4-[(E)-2-[3-methyl-4-(phenylsulfamoyl)phenyl]diazen-1-yl]-5-oxo-4,5-dihydro-1H-pyrazol-1-yl}benzene-1-sulfonic acid::CHEMBL222602
SMILES: Cc1[nH]n(-c2ccc(cc2)S(O)(=O)=O)c(=O)c1N=Nc1ccc(c(C)c1)S(=O)(=O)Nc1ccccc1
InChI Key: InChIKey=XMCBGWZMOXWHLW-UHFFFAOYSA-N
Data: 2 IC50
Activity Spreadsheet -- Enzyme Inhibition Constant Data from BindingDB
Found 2 hits for monomerid = 22582
Trg + Lig
Ki
nM
ΔG°
kcal/mole
IC50
nM
Kd
nM
EC50/IC50
nM
koff
s-1
kon
M-1s-1
pHTemp
°C
AICAR transformylase
(Homo sapiens (Human))
BDBM22582
(324572-F | 4-{3-methyl-4-[(E)-2-[3-methyl-4-(pheny...)
Show SMILES Cc1[nH]n(-c2ccc(cc2)S(O)(=O)=O)c(=O)c1N=Nc1ccc(c(C)c1)S(=O)(=O)Nc1ccccc1 |w:17.18|
Show InChI InChI=1S/C23H21N5O6S2/c1-15-14-18(8-13-21(15)35(30,31)27-17-6-4-3-5-7-17)24-25-22-16(2)26-28(23(22)29)19-9-11-20(12-10-19)36(32,33)34/h3-14,26-27H,1-2H3,(H,32,33,34)
Reactome pathway
n/an/a 1.16E+4n/an/an/an/an/an/a
The Scripps Research Institute
Curated by ChEMBL
Assay Description
Inhibition of human AICAR Tfase
J Med Chem 47: 6681-90 (2004)
Article DOI: 10.1021/jm049504o
BindingDB Entry DOI: 10.7270/Q2PZ589Q
AICAR Tfase
(Homo sapiens (Human))
BDBM22582
(324572-F | 4-{3-methyl-4-[(E)-2-[3-methyl-4-(pheny...)
Show SMILES Cc1[nH]n(-c2ccc(cc2)S(O)(=O)=O)c(=O)c1N=Nc1ccc(c(C)c1)S(=O)(=O)Nc1ccccc1 |w:17.18|
Show InChI InChI=1S/C23H21N5O6S2/c1-15-14-18(8-13-21(15)35(30,31)27-17-6-4-3-5-7-17)24-25-22-16(2)26-28(23(22)29)19-9-11-20(12-10-19)36(32,33)34/h3-14,26-27H,1-2H3,(H,32,33,34)
Reactome pathway
n/an/a 1.16E+4n/an/an/an/a7.522
The Scripps Research Institute
Assay Description
The human ATIC enzyme was used for the inhibition assay. The assay buffer was flushed with nitrogen to minimize oxidization of cofactor 10-f-THF. The...
J Biol Chem 279: 50555-65 (2004)
Article DOI: 10.1074/jbc.M406801200
BindingDB Entry DOI: 10.7270/Q2MC8X97