null
SMILES: O=C1c2ccccc2C(=O)c2c1ccc1nonc21
InChI Key: InChIKey=IRBWFAGWIIHEOF-UHFFFAOYSA-N
Activity Spreadsheet -- Enzyme Inhibition Constant Data from BindingDB
Found 1 hit for monomerid = 225866
Trg + Lig
Ki
nM
ΔG°
kcal/mole
IC50
nM
Kd
nM
EC50/IC50
nM
koff
s-1
kon
M-1s-1
pHTemp
°C
Heat shock protein HSP 90-beta
(Homo sapiens (Human))
BDBM225866
(hsp90_161)
Show SMILES O=C1c2ccccc2C(=O)c2c1ccc1nonc21
Show InChI InChI=1S/C14H6N2O3/c17-13-7-3-1-2-4-8(7)14(18)11-9(13)5-6-10-12(11)16-19-15-10/h1-6H
Reactome pathway
D3R
n/an/a 10n/an/an/an/an/an/a
D3R
Assay Description
FRET Assay 1
D3R 408: (2016)
BindingDB Entry DOI: 10.7270/Q2VX0FC0