BDBM225884 MAP01
SMILES: COc1cc(ccc1O)-c1cnc(Nc2ccc(cc2)N2CCN(C)CC2)c2nccn12
InChI Key: InChIKey=IRMYZDGTYUUDIV-UHFFFAOYSA-N
Data: 1 IC50
Activity Spreadsheet -- Enzyme Inhibition Constant Data from BindingDB
Found 1 hit for monomerid = 225884
Trg + Lig
Ki
nM
ΔG°
kcal/mole
IC50
nM
Kd
nM
EC50/IC50
nM
koff
s-1
kon
M-1s-1
pHTemp
°C
Mitogen-activated protein kinase kinase kinase kinase 4
(Homo sapiens (Human))
BDBM225884
(MAP01)
Show SMILES COc1cc(ccc1O)-c1cnc(Nc2ccc(cc2)N2CCN(C)CC2)c2nccn12
Show InChI InChI=1S/C24H26N6O2/c1-28-11-13-29(14-12-28)19-6-4-18(5-7-19)27-23-24-25-9-10-30(24)20(16-26-23)17-3-8-21(31)22(15-17)32-2/h3-10,15-16,31H,11-14H2,1-2H3,(H,26,27)
NCI pathway
Reactome pathway
D3R
n/an/a 3.79n/an/an/an/an/an/a
D3R
Assay Description
Z'Lyte Assay
D3R 409: (2016)
BindingDB Entry DOI: 10.7270/Q2R49PN1