BDBM22644 2-[4-(benzenesulfonyl)-1-methylpiperazin-2-yl]-N-[(4-fluorophenyl)methyl]-5-hydroxy-1-methyl-6-oxo-1,6-dihydropyrimidine-4-carboxamide::N-Me-pyrimidone deriv., 43
SMILES: CN1CCN(CC1c1nc(C(=O)NCc2ccc(F)cc2)c(O)c(=O)n1C)S(=O)(=O)c1ccccc1
InChI Key: InChIKey=MBPUNGIASDQPCW-UHFFFAOYSA-N
Data: 1 IC50
Activity Spreadsheet -- Enzyme Inhibition Constant Data from BindingDB
Found 1 hit for monomerid = 22644
Trg + Lig
Ki
nM
ΔG°
kcal/mole
IC50
nM
Kd
nM
EC50/IC50
nM
koff
s-1
kon
M-1s-1
pHTemp
°C
Gag-Pol polyprotein
(Human immunodeficiency virus type 1 group M subtyp...)
BDBM22644
(2-[4-(benzenesulfonyl)-1-methylpiperazin-2-yl]-N-[...)
Show SMILES CN1CCN(CC1c1nc(C(=O)NCc2ccc(F)cc2)c(O)c(=O)n1C)S(=O)(=O)c1ccccc1
Show InChI InChI=1S/C24H26FN5O5S/c1-28-12-13-30(36(34,35)18-6-4-3-5-7-18)15-19(28)22-27-20(21(31)24(33)29(22)2)23(32)26-14-16-8-10-17(25)11-9-16/h3-11,19,31H,12-15H2,1-2H3,(H,26,32)
n/an/a 7n/an/an/an/an/an/a
IRBM-MRL
Assay Description
The microtiter plate assay for stand transfer was performed with an immobilized donor substrate and a target substrate biotinylated at the 3-prime en...
J Med Chem 50: 4953-75 (2007)
Article DOI: 10.1021/jm0704705
BindingDB Entry DOI: 10.7270/Q2BZ64BS