BDBM22647 N-Me-pyrimidone deriv., 46::N-[(4-fluorophenyl)methyl]-5-hydroxy-1-methyl-2-(morpholin-3-yl)-6-oxo-1,6-dihydropyrimidine-4-carboxamide
SMILES: Cn1c(nc(C(=O)NCc2ccc(F)cc2)c(O)c1=O)C1COCCN1
InChI Key: InChIKey=FAQIGTGQCLFKIU-UHFFFAOYSA-N
Data: 1 IC50
Activity Spreadsheet -- Enzyme Inhibition Constant Data from BindingDB
Found 1 hit for monomerid = 22647
Trg + Lig
Ki
nM
ΔG°
kcal/mole
IC50
nM
Kd
nM
EC50/IC50
nM
koff
s-1
kon
M-1s-1
pHTemp
°C
Gag-Pol polyprotein
(Human immunodeficiency virus type 1 group M subtyp...)
BDBM22647
(N-Me-pyrimidone deriv., 46 | N-[(4-fluorophenyl)me...)
Show SMILES Cn1c(nc(C(=O)NCc2ccc(F)cc2)c(O)c1=O)C1COCCN1
Show InChI InChI=1S/C17H19FN4O4/c1-22-15(12-9-26-7-6-19-12)21-13(14(23)17(22)25)16(24)20-8-10-2-4-11(18)5-3-10/h2-5,12,19,23H,6-9H2,1H3,(H,20,24)
n/an/a 50n/an/an/an/an/an/a
IRBM-MRL
Assay Description
The microtiter plate assay for stand transfer was performed with an immobilized donor substrate and a target substrate biotinylated at the 3-prime en...
J Med Chem 50: 4953-75 (2007)
Article DOI: 10.1021/jm0704705
BindingDB Entry DOI: 10.7270/Q2BZ64BS