BDBM226472 US9328096, 165
SMILES: Cc1n[nH]c(C)c1NC(=O)c1cc(NC(=O)c2cc(c(Cl)cc2Cl)-c2ncccc2F)n(n1)-c1ccccc1
InChI Key: InChIKey=VEXXAUSRMSHOFS-UHFFFAOYSA-N
Data: 1 IC50
Activity Spreadsheet -- Enzyme Inhibition Constant Data from BindingDB
Found 1 hit for monomerid = 226472
Trg + Lig
Ki
nM
ΔG°
kcal/mole
IC50
nM
Kd
nM
EC50/IC50
nM
koff
s-1
kon
M-1s-1
pHTemp
°C
Tyrosine kinase receptor A (TrkA)
(Homo sapiens (Human))
BDBM226472
(US9328096, 165)
Show SMILES Cc1n[nH]c(C)c1NC(=O)c1cc(NC(=O)c2cc(c(Cl)cc2Cl)-c2ncccc2F)n(n1)-c1ccccc1
Show InChI InChI=1S/C27H20Cl2FN7O2/c1-14-24(15(2)35-34-14)33-27(39)22-13-23(37(36-22)16-7-4-3-5-8-16)32-26(38)18-11-17(19(28)12-20(18)29)25-21(30)9-6-10-31-25/h3-13H,1-2H3,(H,32,38)(H,33,39)(H,34,35)
US Patent
n/an/a 2.45n/an/an/an/an/a37
Pfizer Inc.
US Patent
Assay Description
TRKA co-expressed with p75: The assays are based upon DiscoveRx's proprietary Enzyme Fragment Complementation (EFC) technology. In the case of the TR...
US Patent US9328096 (2016)
BindingDB Entry DOI: 10.7270/Q2FN152J