BDBM22679 Bicyclic pyrimidinone, 13b::N-[(4-fluorophenyl)methyl]-3-hydroxy-9-(N-methylacetamido)-4-oxo-4H,6H,7H,8H,9H-pyrido[1,2-a]pyrimidine-2-carboxamide
SMILES: CN(C1CCCn2c1nc(C(=O)NCc1ccc(F)cc1)c(O)c2=O)C(C)=O
InChI Key: InChIKey=ZMLCBQMRMOWVSI-UHFFFAOYSA-N
Data: 1 IC50
Activity Spreadsheet -- Enzyme Inhibition Constant Data from BindingDB
Found 1 hit for monomerid = 22679
Trg + Lig
Ki
nM
ΔG°
kcal/mole
IC50
nM
Kd
nM
EC50/IC50
nM
koff
s-1
kon
M-1s-1
pHTemp
°C
Gag-Pol polyprotein
(Human immunodeficiency virus type 1 group M subtyp...)
BDBM22679
(Bicyclic pyrimidinone, 13b | N-[(4-fluorophenyl)me...)
Show SMILES CN(C1CCCn2c1nc(C(=O)NCc1ccc(F)cc1)c(O)c2=O)C(C)=O
Show InChI InChI=1S/C19H21FN4O4/c1-11(25)23(2)14-4-3-9-24-17(14)22-15(16(26)19(24)28)18(27)21-10-12-5-7-13(20)8-6-12/h5-8,14,26H,3-4,9-10H2,1-2H3,(H,21,27)
n/an/a 6n/an/an/an/a7.837
IRBM-MRL
Assay Description
The microtiter plate assay for stand transfer was performed with an immobilized donor substrate and a target substrate biotinylated at the 3-prime en...
J Med Chem 51: 861-74 (2008)
Article DOI: 10.1021/jm701164t
BindingDB Entry DOI: 10.7270/Q2765CNT