BDBM2268 2-Pyridinone derivative 48::3-[2-(1,3-benzoxazol-2-yl)ethyl]-6-methyl-5-(propan-2-yl)-1,2-dihydropyridin-2-one::3-[2-(Benzoxazol-2-yl)ethyl]-5-isopropyl-6-methylpyridin-2(1H)-one::CHEMBL176594
SMILES: CC(C)c1cc(CCc2nc3ccccc3o2)c(=O)[nH]c1C
InChI Key: InChIKey=FOHQBRBSZDTCTF-UHFFFAOYSA-N
Data: 2 IC50
Activity Spreadsheet -- Enzyme Inhibition Constant Data from BindingDB
Found 2 hits for monomerid = 2268
Trg + Lig
Ki
nM
ΔG°
kcal/mole
IC50
nM
Kd
nM
EC50/IC50
nM
koff
s-1
kon
M-1s-1
pHTemp
°C
Human immunodeficiency virus type 1 reverse transcriptase
(Human immunodeficiency virus 1)
BDBM2268
(2-Pyridinone derivative 48 | 3-[2-(1,3-benzoxazol-...)
Show SMILES CC(C)c1cc(CCc2nc3ccccc3o2)c(=O)[nH]c1C
Show InChI InChI=1S/C18H20N2O2/c1-11(2)14-10-13(18(21)19-12(14)3)8-9-17-20-15-6-4-5-7-16(15)22-17/h4-7,10-11H,8-9H2,1-3H3,(H,19,21)
n/an/a 48n/an/an/an/an/an/a
Merck Reserch Laboratories
Curated by ChEMBL
Assay Description
Tested for inhibition against HIV-1 RT (used (poly)rC-(oligo)dG as the template)
J Med Chem 36: 953-66 (1993)
BindingDB Entry DOI: 10.7270/Q2JW8G28
HIV-1 Reverse Transcriptase
(Human immunodeficiency virus type 1)
BDBM2268
(2-Pyridinone derivative 48 | 3-[2-(1,3-benzoxazol-...)
Show SMILES CC(C)c1cc(CCc2nc3ccccc3o2)c(=O)[nH]c1C
Show InChI InChI=1S/C18H20N2O2/c1-11(2)14-10-13(18(21)19-12(14)3)8-9-17-20-15-6-4-5-7-16(15)22-17/h4-7,10-11H,8-9H2,1-3H3,(H,19,21)
n/an/a 48n/an/an/an/an/an/a
Merck Reserch Laboratories
Curated by ChEMBL
Assay Description
The IC50 of reverse transcriptase is the concentration that inhibits 50% of recombinant HIV-1 RT RNA-directed DNA polymerase activity in vitro.
J Med Chem 36: 953-66 (1993)
BindingDB Entry DOI: 10.7270/Q2JW8G28