BDBM22687 Bicyclic pyrimidinone, 18b::N-[(4-fluorophenyl)methyl]-3-hydroxy-9-(2-methanesulfonyl-N-methylacetamido)-4-oxo-4H,6H,7H,8H,9H-pyrido[1,2-a]pyrimidine-2-carboxamide
SMILES: CN(C1CCCn2c1nc(C(=O)NCc1ccc(F)cc1)c(O)c2=O)C(=O)CS(C)(=O)=O
InChI Key: InChIKey=PFFFBBACUGSVPN-UHFFFAOYSA-N
Data: 1 IC50
Activity Spreadsheet -- Enzyme Inhibition Constant Data from BindingDB
Found 1 hit for monomerid = 22687
Trg + Lig
Ki
nM
ΔG°
kcal/mole
IC50
nM
Kd
nM
EC50/IC50
nM
koff
s-1
kon
M-1s-1
pHTemp
°C
Gag-Pol polyprotein
(Human immunodeficiency virus type 1 group M subtyp...)
BDBM22687
(Bicyclic pyrimidinone, 18b | N-[(4-fluorophenyl)me...)
Show SMILES CN(C1CCCn2c1nc(C(=O)NCc1ccc(F)cc1)c(O)c2=O)C(=O)CS(C)(=O)=O
Show InChI InChI=1S/C20H23FN4O6S/c1-24(15(26)11-32(2,30)31)14-4-3-9-25-18(14)23-16(17(27)20(25)29)19(28)22-10-12-5-7-13(21)8-6-12/h5-8,14,27H,3-4,9-11H2,1-2H3,(H,22,28)
n/an/a 6n/an/an/an/a7.837
IRBM-MRL
Assay Description
The microtiter plate assay for stand transfer was performed with an immobilized donor substrate and a target substrate biotinylated at the 3-prime en...
J Med Chem 51: 861-74 (2008)
Article DOI: 10.1021/jm701164t
BindingDB Entry DOI: 10.7270/Q2765CNT