BDBM22689 Bicyclic pyrimidinone, 19b::N-[(4-fluorophenyl)methyl]-3-hydroxy-9-(2-methanesulfonylacetamido)-4-oxo-4H,6H,7H,8H,9H-pyrido[1,2-a]pyrimidine-2-carboxamide
SMILES: CS(=O)(=O)CC(=O)NC1CCCn2c1nc(C(=O)NCc1ccc(F)cc1)c(O)c2=O
InChI Key: InChIKey=PWUGNIFZHYPQQA-UHFFFAOYSA-N
Data: 1 IC50
Activity Spreadsheet -- Enzyme Inhibition Constant Data from BindingDB
Found 1 hit for monomerid = 22689
Trg + Lig
Ki
nM
ΔG°
kcal/mole
IC50
nM
Kd
nM
EC50/IC50
nM
koff
s-1
kon
M-1s-1
pHTemp
°C
Gag-Pol polyprotein
(Human immunodeficiency virus type 1 group M subtyp...)
BDBM22689
(Bicyclic pyrimidinone, 19b | N-[(4-fluorophenyl)me...)
Show SMILES CS(=O)(=O)CC(=O)NC1CCCn2c1nc(C(=O)NCc1ccc(F)cc1)c(O)c2=O
Show InChI InChI=1S/C19H21FN4O6S/c1-31(29,30)10-14(25)22-13-3-2-8-24-17(13)23-15(16(26)19(24)28)18(27)21-9-11-4-6-12(20)7-5-11/h4-7,13,26H,2-3,8-10H2,1H3,(H,21,27)(H,22,25)
n/an/a 7n/an/an/an/a7.837
IRBM-MRL
Assay Description
The microtiter plate assay for stand transfer was performed with an immobilized donor substrate and a target substrate biotinylated at the 3-prime en...
J Med Chem 51: 861-74 (2008)
Article DOI: 10.1021/jm701164t
BindingDB Entry DOI: 10.7270/Q2765CNT