BDBM22700 Bicyclic pyrimidinone, 24b::N-[(4-fluorophenyl)methyl]-3-hydroxy-9-[methyl(pyrrolidine-1-sulfonyl)amino]-4-oxo-4H,6H,7H,8H,9H-pyrido[1,2-a]pyrimidine-2-carboxamide
SMILES: CN(C1CCCn2c1nc(C(=O)NCc1ccc(F)cc1)c(O)c2=O)S(=O)(=O)N1CCCC1
InChI Key: InChIKey=GJDMGRQVNYSRDY-UHFFFAOYSA-N
Data: 1 IC50
Activity Spreadsheet -- Enzyme Inhibition Constant Data from BindingDB
Found 1 hit for monomerid = 22700
Trg + Lig
Ki
nM
ΔG°
kcal/mole
IC50
nM
Kd
nM
EC50/IC50
nM
koff
s-1
kon
M-1s-1
pHTemp
°C
Gag-Pol polyprotein
(Human immunodeficiency virus type 1 group M subtyp...)
BDBM22700
(Bicyclic pyrimidinone, 24b | N-[(4-fluorophenyl)me...)
Show SMILES CN(C1CCCn2c1nc(C(=O)NCc1ccc(F)cc1)c(O)c2=O)S(=O)(=O)N1CCCC1
Show InChI InChI=1S/C21H26FN5O5S/c1-25(33(31,32)26-10-2-3-11-26)16-5-4-12-27-19(16)24-17(18(28)21(27)30)20(29)23-13-14-6-8-15(22)9-7-14/h6-9,16,28H,2-5,10-13H2,1H3,(H,23,29)
n/an/a 7n/an/an/an/an/an/a
IRBM-MRL
Assay Description
The microtiter plate assay for stand transfer was performed with an immobilized donor substrate and a target substrate biotinylated at the 3-prime en...
J Med Chem 51: 861-74 (2008)
Article DOI: 10.1021/jm701164t
BindingDB Entry DOI: 10.7270/Q2765CNT