BDBM227052 US9328096, 740
SMILES: Fc1cccnc1-c1cc(C(=O)Nc2cc(nn2-c2ccccc2)C(=O)NCc2cncnc2)c(Cl)cc1Cl
InChI Key: InChIKey=XYCBAYLIRXHFPB-UHFFFAOYSA-N
Data: 1 IC50
Activity Spreadsheet -- Enzyme Inhibition Constant Data from BindingDB
Found 1 hit for monomerid = 227052
Trg + Lig
Ki
nM
ΔG°
kcal/mole
IC50
nM
Kd
nM
EC50/IC50
nM
koff
s-1
kon
M-1s-1
pHTemp
°C
Tyrosine kinase receptor A (TrkA)
(Homo sapiens (Human))
BDBM227052
(US9328096, 740)
Show SMILES Fc1cccnc1-c1cc(C(=O)Nc2cc(nn2-c2ccccc2)C(=O)NCc2cncnc2)c(Cl)cc1Cl
Show InChI InChI=1S/C27H18Cl2FN7O2/c28-20-10-21(29)19(9-18(20)25-22(30)7-4-8-33-25)26(38)35-24-11-23(36-37(24)17-5-2-1-3-6-17)27(39)34-14-16-12-31-15-32-13-16/h1-13,15H,14H2,(H,34,39)(H,35,38)
US Patent
n/an/a 2.02n/an/an/an/an/a37
Pfizer Inc.
US Patent
Assay Description
TRKA co-expressed with p75: The assays are based upon DiscoveRx's proprietary Enzyme Fragment Complementation (EFC) technology. In the case of the TR...
US Patent US9328096 (2016)
BindingDB Entry DOI: 10.7270/Q2FN152J