BDBM227440 US9328106, 393
SMILES: Cn1ncc(NC(=O)c2csc(n2)-c2ccc(cc2F)C2(C)COC2)c1[C@@H]1CC[C@@H](N)[C@H](F)CO1
InChI Key: InChIKey=GKUHSXVRNPMMBW-HLIPFELVSA-N
Data: 1 KI
Activity Spreadsheet -- Enzyme Inhibition Constant Data from BindingDB
Found 1 hit for monomerid = 227440
Trg + Lig
Ki
nM
ΔG°
kcal/mole
IC50
nM
Kd
nM
EC50/IC50
nM
koff
s-1
kon
M-1s-1
pHTemp
°C
Serine/threonine-protein kinase pim-1
(Homo sapiens (Human))
BDBM227440
(US9328106, 393)
Show SMILES Cn1ncc(NC(=O)c2csc(n2)-c2ccc(cc2F)C2(C)COC2)c1[C@@H]1CC[C@@H](N)[C@H](F)CO1 |r|
Show InChI InChI=1S/C24H27F2N5O3S/c1-24(11-33-12-24)13-3-4-14(15(25)7-13)23-30-19(10-35-23)22(32)29-18-8-28-31(2)21(18)20-6-5-17(27)16(26)9-34-20/h3-4,7-8,10,16-17,20H,5-6,9,11-12,27H2,1-2H3,(H,29,32)/t16-,17-,20+/m1/s1
US Patent
0.00300 -15.7n/an/an/an/an/a7.225
GENENTECH, INC.
US Patent
Assay Description
LC3K assay: PIM-1, -2, and -3 enzymes were generated as fusion proteins expressed in bacteria and purified by IMAC column chromatography (Sun, X., Ch...
US Patent US9328106 (2016)
BindingDB Entry DOI: 10.7270/Q29W0DBT