BDBM2275 2-Pyridinone derivative 56::3-[2-(4,7-Diohlorobenzoxazol-2-yl)ethyl]-5,6-dimethylpyridin-2(1H)-one::3-[2-(4,7-dichloro-1,3-benzoxazol-2-yl)ethyl]-5,6-dimethyl-1,2-dihydropyridin-2-one::CHEMBL174364
SMILES: Cc1cc(CCc2nc3c(Cl)ccc(Cl)c3o2)c(=O)[nH]c1C
InChI Key: InChIKey=YTGFGCMQIQOFQF-UHFFFAOYSA-N
Data: 2 IC50
Activity Spreadsheet -- Enzyme Inhibition Constant Data from BindingDB
Found 2 hits for monomerid = 2275
Trg + Lig
Ki
nM
ΔG°
kcal/mole
IC50
nM
Kd
nM
EC50/IC50
nM
koff
s-1
kon
M-1s-1
pHTemp
°C
Human immunodeficiency virus type 1 reverse transcriptase
(Human immunodeficiency virus 1)
BDBM2275
(2-Pyridinone derivative 56 | 3-[2-(4,7-Diohloroben...)
Show SMILES Cc1cc(CCc2nc3c(Cl)ccc(Cl)c3o2)c(=O)[nH]c1C
Show InChI InChI=1S/C16H14Cl2N2O2/c1-8-7-10(16(21)19-9(8)2)3-6-13-20-14-11(17)4-5-12(18)15(14)22-13/h4-5,7H,3,6H2,1-2H3,(H,19,21)
n/an/a 97n/an/an/an/an/an/a
Merck Reserch Laboratories
Curated by ChEMBL
Assay Description
Tested for inhibition against HIV-1 RT (used (poly)rC-(oligo)dG as the template)
J Med Chem 36: 953-66 (1993)
BindingDB Entry DOI: 10.7270/Q2JW8G28
HIV-1 Reverse Transcriptase
(Human immunodeficiency virus type 1)
BDBM2275
(2-Pyridinone derivative 56 | 3-[2-(4,7-Diohloroben...)
Show SMILES Cc1cc(CCc2nc3c(Cl)ccc(Cl)c3o2)c(=O)[nH]c1C
Show InChI InChI=1S/C16H14Cl2N2O2/c1-8-7-10(16(21)19-9(8)2)3-6-13-20-14-11(17)4-5-12(18)15(14)22-13/h4-5,7H,3,6H2,1-2H3,(H,19,21)
n/an/a 97n/an/an/an/an/an/a
Merck Reserch Laboratories
Curated by ChEMBL
Assay Description
The IC50 of reverse transcriptase is the concentration that inhibits 50% of recombinant HIV-1 RT RNA-directed DNA polymerase activity in vitro.
J Med Chem 36: 953-66 (1993)
BindingDB Entry DOI: 10.7270/Q2JW8G28