BDBM227695 2-{1-[6-(5-chloropyridin- 3-yl)-7-[(trans-4- methylcyclohexyl)methyl]- 2-(5-oxo-4,5-dihydro- 1,2,4-oxadiazol-3-yl)-7h- purin-8-yl]-1- fluoroethyl}benzonitrile (racemate)::US9540377, 23.110
SMILES: C[C@H]1CC[C@H](Cn2c(nc3nc(nc(-c4cncc(Cl)c4)c23)-c2noc(=O)[nH]2)C(C)(F)c2ccccc2C#N)CC1
InChI Key:
Data: 1 IC50
Activity Spreadsheet -- Enzyme Inhibition Constant Data from BindingDB
Found 1 hit for monomerid = 227695
Trg + Lig
Ki
nM
ΔG°
kcal/mole
IC50
nM
Kd
nM
EC50/IC50
nM
koff
s-1
kon
M-1s-1
pHTemp
°C
p53-binding protein Mdm2
(Homo sapiens (Human))
BDBM227695
(2-{1-[6-(5-chloropyridin- 3-yl)-7-[(trans-4- methy...)
Show SMILES C[C@H]1CC[C@H](Cn2c(nc3nc(nc(-c4cncc(Cl)c4)c23)-c2noc(=O)[nH]2)C(C)(F)c2ccccc2C#N)CC1 |r,wU:1.0,wD:4.4,(7.09,-3.69,;5.6,-3.29,;4.52,-4.38,;3.03,-3.98,;2.63,-2.5,;1.14,-2.1,;.74,-.61,;1.65,.64,;.74,1.88,;-.72,1.41,;-2.05,2.18,;-3.39,1.41,;-3.39,-.13,;-2.05,-.9,;-2.05,-2.44,;-.72,-3.21,;-.72,-4.75,;-2.05,-5.52,;-3.39,-4.75,;-4.72,-5.52,;-3.39,-3.21,;-.72,-.13,;-4.72,2.18,;-6.19,1.7,;-7.09,2.95,;-6.19,4.19,;-6.96,5.52,;-4.72,3.72,;3.19,.64,;4.52,-.13,;2.42,-.7,;3.96,1.97,;3.19,3.3,;3.96,4.64,;5.5,4.64,;6.27,3.3,;5.5,1.97,;6.27,.64,;7.04,-.7,;3.72,-1.41,;5.21,-1.81,)|
US Patent
n/an/a 0.515n/an/an/an/an/a25
Merck Sharp & Dohme Corp.
US Patent
Assay Description
An HDM2 FRET assay was developed to assess the compounds' inhibitory activity towards binding of p53 protein. A truncated version of HDM2 with re...
US Patent US9540377 (2017)
BindingDB Entry DOI: 10.7270/Q2RF5X1F