BDBM227715 US9556170, 2
SMILES: CN1CCN(CC1)S(=O)(=O)c1ccc2[nH]c(Nc3cc(Cl)ccc3O)nc2c1
InChI Key: InChIKey=WYWUOCBVOUFBDY-UHFFFAOYSA-N
Data: 1 IC50
Activity Spreadsheet -- Enzyme Inhibition Constant Data from BindingDB
Found 1 hit for monomerid = 227715
Trg + Lig
Ki
nM
ΔG°
kcal/mole
IC50
nM
Kd
nM
EC50/IC50
nM
koff
s-1
kon
M-1s-1
pHTemp
°C
Lysine-specific histone demethylase 1A
(Homo sapiens (Human))
BDBM227715
(US9556170, 2)
Show SMILES CN1CCN(CC1)S(=O)(=O)c1ccc2[nH]c(Nc3cc(Cl)ccc3O)nc2c1
Show InChI InChI=1S/C18H20ClN5O3S/c1-23-6-8-24(9-7-23)28(26,27)13-3-4-14-15(11-13)21-18(20-14)22-16-10-12(19)2-5-17(16)25/h2-5,10-11,25H,6-9H2,1H3,(H2,20,21,22)
Reactome pathway
US Patent
n/an/a 273n/an/an/an/an/an/a
University of Utah Research Foundation
US Patent
Assay Description
Inhibition of LSD activity can be determined by a variety of both in vitro and in vivo methods known to one skilled in the art. For example, enzymati...
US Patent US9556170 (2017)
BindingDB Entry DOI: 10.7270/Q2GX4DJX