null
SMILES: CC(=O)N1CCC(CC1)C1CN(C1)c1cccc(COC(=O)CC(N)=N)c1F
InChI Key: InChIKey=KYLAOSCVMAAQEH-UHFFFAOYSA-N
Activity Spreadsheet -- Enzyme Inhibition Constant Data from BindingDB
Found 4 hits for monomerid = 228098
Trg + Lig
Ki
nM
ΔG°
kcal/mole
IC50
nM
Kd
nM
EC50/IC50
nM
koff
s-1
kon
M-1s-1
pHTemp
°C
Membrane primary amine oxidase
(Homo sapiens (Human))
BDBM228098
(US9556160, ex 559 | US9556160, ex 567)
Show SMILES CC(=O)N1CCC(CC1)C1CN(C1)c1cccc(COC(=O)CC(N)=N)c1F
Show InChI InChI=1S/C20H27FN4O3/c1-13(26)24-7-5-14(6-8-24)16-10-25(11-16)17-4-2-3-15(20(17)21)12-28-19(27)9-18(22)23/h2-4,14,16H,5-12H2,1H3,(H3,22,23)
US Patent
n/an/a 4.30n/an/an/an/an/a25
Astellas Pharma Inc.
US Patent
Assay Description
A human VAP-1 enzyme (SSAO) (reference: J Exp Med. 1998 Jul. 6; 188(1): 17 to 27) activity was measured by a radiochemistry-enzymatic assay using 14C...
US Patent US9556160 (2017)
BindingDB Entry DOI: 10.7270/Q2KP845Q
Membrane primary amine oxidase
(Rattus norvegicus (Rat))
BDBM228098
(US9556160, ex 559 | US9556160, ex 567)
Show SMILES CC(=O)N1CCC(CC1)C1CN(C1)c1cccc(COC(=O)CC(N)=N)c1F
Show InChI InChI=1S/C20H27FN4O3/c1-13(26)24-7-5-14(6-8-24)16-10-25(11-16)17-4-2-3-15(20(17)21)12-28-19(27)9-18(22)23/h2-4,14,16H,5-12H2,1H3,(H3,22,23)
US Patent
n/an/a 0.810n/an/an/an/an/a25
Astellas Pharma Inc.
US Patent
Assay Description
A rat VAP-1 enzyme (SSAO) (reference: Biol Pharm Bull. 2005 March; 28(3): 413-8) activity was measured by a radiochemistry-enzymatic assay using 14C-...
US Patent US9556160 (2017)
BindingDB Entry DOI: 10.7270/Q2KP845Q
Membrane primary amine oxidase
(Homo sapiens (Human))
BDBM228098
(US9556160, ex 559 | US9556160, ex 567)
Show SMILES CC(=O)N1CCC(CC1)C1CN(C1)c1cccc(COC(=O)CC(N)=N)c1F
Show InChI InChI=1S/C20H27FN4O3/c1-13(26)24-7-5-14(6-8-24)16-10-25(11-16)17-4-2-3-15(20(17)21)12-28-19(27)9-18(22)23/h2-4,14,16H,5-12H2,1H3,(H3,22,23)
US Patent
n/an/a 4.30n/an/an/an/an/a25
Astellas Pharma Inc.
US Patent
Assay Description
A human VAP-1 enzyme (SSAO) (reference: J Exp Med. 1998 Jul. 6; 188(1): 17 to 27) activity was measured by a radiochemistry-enzymatic assay using 14C...
US Patent US9556160 (2017)
BindingDB Entry DOI: 10.7270/Q2KP845Q
Membrane primary amine oxidase
(Rattus norvegicus (Rat))
BDBM228098
(US9556160, ex 559 | US9556160, ex 567)
Show SMILES CC(=O)N1CCC(CC1)C1CN(C1)c1cccc(COC(=O)CC(N)=N)c1F
Show InChI InChI=1S/C20H27FN4O3/c1-13(26)24-7-5-14(6-8-24)16-10-25(11-16)17-4-2-3-15(20(17)21)12-28-19(27)9-18(22)23/h2-4,14,16H,5-12H2,1H3,(H3,22,23)
US Patent
n/an/a 0.810n/an/an/an/an/a25
Astellas Pharma Inc.
US Patent
Assay Description
A rat VAP-1 enzyme (SSAO) (reference: Biol Pharm Bull. 2005 March; 28(3): 413-8) activity was measured by a radiochemistry-enzymatic assay using 14C-...
US Patent US9556160 (2017)
BindingDB Entry DOI: 10.7270/Q2KP845Q