null
SMILES: Cc1cc(ccc1Nc1nc2ccc(cn2n1)-c1ccc(NC(=O)Cc2ccc(F)cc2)cc1)C1=NCCO1
InChI Key: InChIKey=CPMWNRFLWQTDNQ-UHFFFAOYSA-N
Activity Spreadsheet -- Enzyme Inhibition Constant Data from BindingDB
Found 1 hit for monomerid = 228277
Trg + Lig
Ki
nM
ΔG°
kcal/mole
IC50
nM
Kd
nM
EC50/IC50
nM
koff
s-1
kon
M-1s-1
pHTemp
°C
Dual specificity protein kinase TTK
(Homo sapiens (Human))
BDBM228277
(US9555022, Example 02.15)
Show SMILES Cc1cc(ccc1Nc1nc2ccc(cn2n1)-c1ccc(NC(=O)Cc2ccc(F)cc2)cc1)C1=NCCO1 |t:39|
Show InChI InChI=1S/C30H25FN6O2/c1-19-16-22(29-32-14-15-39-29)6-12-26(19)34-30-35-27-13-7-23(18-37(27)36-30)21-4-10-25(11-5-21)33-28(38)17-20-2-8-24(31)9-3-20/h2-13,16,18H,14-15,17H2,1H3,(H,33,38)(H,34,36)
US Patent
n/an/a<1n/an/an/an/a7.7n/a
Bayer Intellectual Property GmbH
US Patent
Assay Description
For the assay 50 nl of a 100-fold concentrated solution of the test compound in DMSO was pipetted into a black low volume 384 well microtiter plate (...
US Patent US9555022 (2017)
BindingDB Entry DOI: 10.7270/Q25H7J86