BDBM228278 US9555022, Example 02.16
SMILES: COc1cc(ccc1Nc1nc2ccc(cn2n1)-c1ccc(NC(=O)Cc2ccc(F)cc2)cc1)C(=O)N1C[C@@H]2C[C@H]1CO2
InChI Key: InChIKey=MQBHZDRPUSJFLC-SVBPBHIXSA-N
Data: 2 IC50
Activity Spreadsheet -- Enzyme Inhibition Constant Data from BindingDB
Found 2 hits for monomerid = 228278
Trg + Lig
Ki
nM
ΔG°
kcal/mole
IC50
nM
Kd
nM
EC50/IC50
nM
koff
s-1
kon
M-1s-1
pHTemp
°C
Dual specificity protein kinase TTK
(Homo sapiens (Human))
BDBM228278
(US9555022, Example 02.16)
Show SMILES COc1cc(ccc1Nc1nc2ccc(cn2n1)-c1ccc(NC(=O)Cc2ccc(F)cc2)cc1)C(=O)N1C[C@@H]2C[C@H]1CO2 |r,TLB:35:37:43.42:40|
Show InChI InChI=1S/C33H29FN6O4/c1-43-29-15-22(32(42)39-18-27-16-26(39)19-44-27)6-12-28(29)36-33-37-30-13-7-23(17-40(30)38-33)21-4-10-25(11-5-21)35-31(41)14-20-2-8-24(34)9-3-20/h2-13,15,17,26-27H,14,16,18-19H2,1H3,(H,35,41)(H,36,38)/t26-,27-/m0/s1
n/an/a 0.150n/an/an/an/an/an/a
Bayer AG
Curated by ChEMBL
Assay Description
Inhibition of GST-tagged recombinant human MPS1 expressed in baculovirus expression system using biotin-Ahx-PWDPDDADITEILG as substrate preincubated ...
J Med Chem 63: 8025-8042 (2020)
Dual specificity protein kinase TTK
(Homo sapiens (Human))
BDBM228278
(US9555022, Example 02.16)
Show SMILES COc1cc(ccc1Nc1nc2ccc(cn2n1)-c1ccc(NC(=O)Cc2ccc(F)cc2)cc1)C(=O)N1C[C@@H]2C[C@H]1CO2 |r,TLB:35:37:43.42:40|
Show InChI InChI=1S/C33H29FN6O4/c1-43-29-15-22(32(42)39-18-27-16-26(39)19-44-27)6-12-28(29)36-33-37-30-13-7-23(17-40(30)38-33)21-4-10-25(11-5-21)35-31(41)14-20-2-8-24(34)9-3-20/h2-13,15,17,26-27H,14,16,18-19H2,1H3,(H,35,41)(H,36,38)/t26-,27-/m0/s1
US Patent
n/an/a<1n/an/an/an/a7.7n/a
Bayer Intellectual Property GmbH
US Patent
Assay Description
For the assay 50 nl of a 100-fold concentrated solution of the test compound in DMSO was pipetted into a black low volume 384 well microtiter plate (...
US Patent US9555022 (2017)
BindingDB Entry DOI: 10.7270/Q25H7J86