null
SMILES: COc1cc(ccc1Nc1nc2ccc(cn2n1)-c1ccc(C(=O)NCc2ccc(F)cc2)c(OC)c1)C(=O)N1CCOCC1
InChI Key: InChIKey=FJUISISZRWEZKS-UHFFFAOYSA-N
Activity Spreadsheet -- Enzyme Inhibition Constant Data from BindingDB
Found 1 hit for monomerid = 228383
Trg + Lig
Ki
nM
ΔG°
kcal/mole
IC50
nM
Kd
nM
EC50/IC50
nM
koff
s-1
kon
M-1s-1
pHTemp
°C
Dual specificity protein kinase TTK
(Homo sapiens (Human))
BDBM228383
(US9555022, Example 09.01)
Show SMILES COc1cc(ccc1Nc1nc2ccc(cn2n1)-c1ccc(C(=O)NCc2ccc(F)cc2)c(OC)c1)C(=O)N1CCOCC1
Show InChI InChI=1S/C33H31FN6O5/c1-43-28-17-22(5-10-26(28)31(41)35-19-21-3-8-25(34)9-4-21)24-7-12-30-37-33(38-40(30)20-24)36-27-11-6-23(18-29(27)44-2)32(42)39-13-15-45-16-14-39/h3-12,17-18,20H,13-16,19H2,1-2H3,(H,35,41)(H,36,38)
US Patent
n/an/a<1n/an/an/an/a7.7n/a
Bayer Intellectual Property GmbH
US Patent
Assay Description
For the assay 50 nl of a 100-fold concentrated solution of the test compound in DMSO was pipetted into a black low volume 384 well microtiter plate (...
US Patent US9555022 (2017)
BindingDB Entry DOI: 10.7270/Q25H7J86