BDBM228401 US9556135, 18
SMILES: CC1(C)C(N)=N[C@@](C)(CS1(=O)=O)c1cc(NC(=O)c2ccc(F)cn2)ccc1F
InChI Key: InChIKey=IXNHXYGWJABLFS-IBGZPJMESA-N
Data: 2 IC50
Activity Spreadsheet -- Enzyme Inhibition Constant Data from BindingDB
Found 2 hits for monomerid = 228401
Trg + Lig
Ki
nM
ΔG°
kcal/mole
IC50
nM
Kd
nM
EC50/IC50
nM
koff
s-1
kon
M-1s-1
pHTemp
°C
Cathepsin D
(Homo sapiens (Human))
BDBM228401
(US9556135, 18)
Show SMILES CC1(C)C(N)=N[C@@](C)(CS1(=O)=O)c1cc(NC(=O)c2ccc(F)cn2)ccc1F |r,c:4|
Show InChI InChI=1S/C19H20F2N4O3S/c1-18(2)17(22)25-19(3,10-29(18,27)28)13-8-12(5-6-14(13)21)24-16(26)15-7-4-11(20)9-23-15/h4-9H,10H2,1-3H3,(H2,22,25)(H,24,26)/t19-/m0/s1
NCI pathway
Reactome pathway
US Patent
n/an/a>4.00E+5n/an/an/an/a3.5n/a
Amgen, Inc.
US Patent
Assay Description
Recombinant Cat D was expressed in CHO cells. The assay buffer for CathepsinD is 0.05 M citrate pH 3.5, 10% DMSO final, 5 mM CHAPS. The Cat D enzyme ...
US Patent US9556135 (2017)
BindingDB Entry DOI: 10.7270/Q2X0691F
Beta-secretase 1
(Homo sapiens (Human))
BDBM228401
(US9556135, 18)
Show SMILES CC1(C)C(N)=N[C@@](C)(CS1(=O)=O)c1cc(NC(=O)c2ccc(F)cn2)ccc1F |r,c:4|
Show InChI InChI=1S/C19H20F2N4O3S/c1-18(2)17(22)25-19(3,10-29(18,27)28)13-8-12(5-6-14(13)21)24-16(26)15-7-4-11(20)9-23-15/h4-9H,10H2,1-3H3,(H2,22,25)(H,24,26)/t19-/m0/s1
US Patent
n/an/a 1.90n/an/an/an/an/an/a
Amgen, Inc.
US Patent
Assay Description
Several animal models, including mouse, rat, dog, and monkey, may be used to screen for inhibition of beta-secretase activity in vivo following admin...
US Patent US9556135 (2017)
BindingDB Entry DOI: 10.7270/Q2X0691F