BDBM228499 US9340521, E051
SMILES: CCOc1ccc(Cc2cc([C@@H]3O[C@H](SC)[C@@H](O)[C@H](O)[C@H]3O)c3OCOc3c2Cl)cc1
InChI Key: InChIKey=HBTBVDCDESHQFR-ZBHHGKBUSA-N
Data: 2 IC50
Activity Spreadsheet -- Enzyme Inhibition Constant Data from BindingDB
Found 2 hits for monomerid = 228499
Trg + Lig
Ki
nM
ΔG°
kcal/mole
IC50
nM
Kd
nM
EC50/IC50
nM
koff
s-1
kon
M-1s-1
pHTemp
°C
Sodium/glucose cotransporter 1 (SGLT1)
(Homo sapiens (Human))
BDBM228499
(US9340521, E051)
Show SMILES CCOc1ccc(Cc2cc([C@@H]3O[C@H](SC)[C@@H](O)[C@H](O)[C@H]3O)c3OCOc3c2Cl)cc1 |r|
Show InChI InChI=1S/C22H25ClO7S/c1-3-27-13-6-4-11(5-7-13)8-12-9-14(20-21(15(12)23)29-10-28-20)19-17(25)16(24)18(26)22(30-19)31-2/h4-7,9,16-19,22,24-26H,3,8,10H2,1-2H3/t16-,17-,18+,19+,22-/m1/s1
US Patent
n/an/a 62.4n/an/an/an/a7.437
GREEN CROSS CORPORATION
US Patent
Assay Description
For sodium-dependent glucose transport assay, cells expressing hSGLT1 were seeded into a 96-well culture plate at a density of 5×104 cells/well...
US Patent US9340521 (2016)
BindingDB Entry DOI: 10.7270/Q2TQ60CH
Sodium/glucose cotransporter 2
(Homo sapiens (Human))
BDBM228499
(US9340521, E051)
Show SMILES CCOc1ccc(Cc2cc([C@@H]3O[C@H](SC)[C@@H](O)[C@H](O)[C@H]3O)c3OCOc3c2Cl)cc1 |r|
Show InChI InChI=1S/C22H25ClO7S/c1-3-27-13-6-4-11(5-7-13)8-12-9-14(20-21(15(12)23)29-10-28-20)19-17(25)16(24)18(26)22(30-19)31-2/h4-7,9,16-19,22,24-26H,3,8,10H2,1-2H3/t16-,17-,18+,19+,22-/m1/s1
US Patent
n/an/a 0.490n/an/an/an/a7.437
GREEN CROSS CORPORATION
US Patent
Assay Description
For sodium-dependent glucose transport assay, cells expressing hSGLT2 were seeded into a 96-well culture plate at a density of 5×104 cells/well...
US Patent US9340521 (2016)
BindingDB Entry DOI: 10.7270/Q2TQ60CH