BDBM228630 US9345793, 11::US9744252, Example 11
SMILES: OC(=O)C[C@H](NC(=O)[C@@H]1CCCN(C1)C(=O)CCC1CCNCC1)c1cncc(c1)-c1ccc(F)c(c1)[N+]([O-])=O
InChI Key: InChIKey=DSEQSPZXYSBJIV-YKSBVNFPSA-N
Data: 2 IC50
Activity Spreadsheet -- Enzyme Inhibition Constant Data from BindingDB
Found 2 hits for monomerid = 228630
Trg + Lig
Ki
nM
ΔG°
kcal/mole
IC50
nM
Kd
nM
EC50/IC50
nM
koff
s-1
kon
M-1s-1
pHTemp
°C
Integrin alpha-IIb
(Homo sapiens (Human))
BDBM228630
(US9345793, 11 | US9744252, Example 11)
Show SMILES OC(=O)C[C@H](NC(=O)[C@@H]1CCCN(C1)C(=O)CCC1CCNCC1)c1cncc(c1)-c1ccc(F)c(c1)[N+]([O-])=O |r|
Show InChI InChI=1S/C28H34FN5O6/c29-23-5-4-19(13-25(23)34(39)40)21-12-22(16-31-15-21)24(14-27(36)37)32-28(38)20-2-1-11-33(17-20)26(35)6-3-18-7-9-30-10-8-18/h4-5,12-13,15-16,18,20,24,30H,1-3,6-11,14,17H2,(H,32,38)(H,36,37)/t20-,24+/m1/s1
US Patent
n/an/a 14n/an/an/an/an/an/a
PIRAMAL IMAGING SA
US Patent
Assay Description
Purified human glycoprotein IIb/IIIa (20 mM Tris-HCl, 0.1 M NaCl, 0.1% Triton X-100, 1 mM CaCl2, 0.05% NaN3, 50% Glycerol, pH 7.4) was purchased from...
US Patent US9744252 (2017)
BindingDB Entry DOI: 10.7270/Q2F76FN7
Integrin alpha-IIb/beta-3
(Homo sapiens (Human))
BDBM228630
(US9345793, 11 | US9744252, Example 11)
Show SMILES OC(=O)C[C@H](NC(=O)[C@@H]1CCCN(C1)C(=O)CCC1CCNCC1)c1cncc(c1)-c1ccc(F)c(c1)[N+]([O-])=O |r|
Show InChI InChI=1S/C28H34FN5O6/c29-23-5-4-19(13-25(23)34(39)40)21-12-22(16-31-15-21)24(14-27(36)37)32-28(38)20-2-1-11-33(17-20)26(35)6-3-18-7-9-30-10-8-18/h4-5,12-13,15-16,18,20,24,30H,1-3,6-11,14,17H2,(H,32,38)(H,36,37)/t20-,24+/m1/s1
US Patent
n/an/a 14n/an/an/an/an/a2
PIRAMAL IMAGING SA
US Patent
Assay Description
The GPIIb/IIIa receptor was immobilized 48 hours at least (100 μL per well, 48 to maximum 96 hours) on a 96-well solid plate (Immuno Plate MaxiSor...
US Patent US9345793 (2016)
BindingDB Entry DOI: 10.7270/Q22806GR