BDBM228637 US9345793, 18::US9744252, Example 18
SMILES: OC(=O)C[C@H](NC(=O)[C@@H]1CCCN(C1)C(=O)CCC1CCNCC1)c1cncc(CCc2ccc(OCCF)cc2)c1
InChI Key: InChIKey=RWGBUALVFDFMJM-UHSQPCAPSA-N
Data: 2 IC50
Activity Spreadsheet -- Enzyme Inhibition Constant Data from BindingDB
Found 2 hits for monomerid = 228637
Trg + Lig
Ki
nM
ΔG°
kcal/mole
IC50
nM
Kd
nM
EC50/IC50
nM
koff
s-1
kon
M-1s-1
pHTemp
°C
Integrin alpha-IIb
(Homo sapiens (Human))
BDBM228637
(US9345793, 18 | US9744252, Example 18)
Show SMILES OC(=O)C[C@H](NC(=O)[C@@H]1CCCN(C1)C(=O)CCC1CCNCC1)c1cncc(CCc2ccc(OCCF)cc2)c1 |r|
Show InChI InChI=1S/C32H43FN4O5/c33-13-17-42-28-8-5-23(6-9-28)3-4-25-18-27(21-35-20-25)29(19-31(39)40)36-32(41)26-2-1-16-37(22-26)30(38)10-7-24-11-14-34-15-12-24/h5-6,8-9,18,20-21,24,26,29,34H,1-4,7,10-17,19,22H2,(H,36,41)(H,39,40)/t26-,29+/m1/s1
US Patent
n/an/a 3n/an/an/an/an/an/a
PIRAMAL IMAGING SA
US Patent
Assay Description
Purified human glycoprotein IIb/IIIa (20 mM Tris-HCl, 0.1 M NaCl, 0.1% Triton X-100, 1 mM CaCl2, 0.05% NaN3, 50% Glycerol, pH 7.4) was purchased from...
US Patent US9744252 (2017)
BindingDB Entry DOI: 10.7270/Q2F76FN7
Integrin alpha-IIb/beta-3
(Homo sapiens (Human))
BDBM228637
(US9345793, 18 | US9744252, Example 18)
Show SMILES OC(=O)C[C@H](NC(=O)[C@@H]1CCCN(C1)C(=O)CCC1CCNCC1)c1cncc(CCc2ccc(OCCF)cc2)c1 |r|
Show InChI InChI=1S/C32H43FN4O5/c33-13-17-42-28-8-5-23(6-9-28)3-4-25-18-27(21-35-20-25)29(19-31(39)40)36-32(41)26-2-1-16-37(22-26)30(38)10-7-24-11-14-34-15-12-24/h5-6,8-9,18,20-21,24,26,29,34H,1-4,7,10-17,19,22H2,(H,36,41)(H,39,40)/t26-,29+/m1/s1
US Patent
n/an/a 3n/an/an/an/an/a2
PIRAMAL IMAGING SA
US Patent
Assay Description
The GPIIb/IIIa receptor was immobilized 48 hours at least (100 μL per well, 48 to maximum 96 hours) on a 96-well solid plate (Immuno Plate MaxiSor...
US Patent US9345793 (2016)
BindingDB Entry DOI: 10.7270/Q22806GR