BDBM228840 PTHRct-8::QEEWETVM
SMILES: CSCC[C@H](NC(=O)[C@@H](NC(=O)[C@@H](NC(=O)[C@H](CCC(O)=O)NC(=O)[C@H](Cc1c[nH]c2ccccc12)NC(=O)[C@H](CCC(O)=O)NC(=O)[C@H](CCC(O)=O)NC(=O)[C@@H](N)CCC(N)=O)[C@@H](C)O)C(C)C)C(O)=O
InChI Key:
Data: 2 Kd  2 ITC
Activity Spreadsheet -- Enzyme Inhibition Constant Data from BindingDB
Found 2 hits for monomerid = 228840
Trg + Lig
Ki
nM
ΔG°
kcal/mole
IC50
nM
Kd
nM
EC50/IC50
nM
koff
s-1
kon
M-1s-1
pHTemp
°C
Na+/H+ exchanger regulatory factor-1 PDZ domain (PDZ2)
(Homo sapiens (Human))
BDBM228840
(PTHRct-8 | QEEWETVM)
Show SMILES CSCC[C@H](NC(=O)[C@@H](NC(=O)[C@@H](NC(=O)[C@H](CCC(O)=O)NC(=O)[C@H](Cc1c[nH]c2ccccc12)NC(=O)[C@H](CCC(O)=O)NC(=O)[C@H](CCC(O)=O)NC(=O)[C@@H](N)CCC(N)=O)[C@@H](C)O)C(C)C)C(O)=O |r|
n/an/an/a 9.70E+3n/an/an/a8.025
The University of Queensland
Assay Description
ITC measurements were conducted on a Microcal iTC200 (Malvern Instruments) in buffer consisting of 25 mM Tris (pH 8.0) and 100 mM NaCl. Proteins were...
Biochemistry 56: 2584-2593 (2017)
Article DOI: 10.1021/acs.biochem.7b00078
BindingDB Entry DOI: 10.7270/Q2QV3KD9
Na+/H+ exchanger regulatory factor-1 PDZ domain (PDZ1)
(Homo sapiens (Human))
BDBM228840
(PTHRct-8 | QEEWETVM)
Show SMILES CSCC[C@H](NC(=O)[C@@H](NC(=O)[C@@H](NC(=O)[C@H](CCC(O)=O)NC(=O)[C@H](Cc1c[nH]c2ccccc12)NC(=O)[C@H](CCC(O)=O)NC(=O)[C@H](CCC(O)=O)NC(=O)[C@@H](N)CCC(N)=O)[C@@H](C)O)C(C)C)C(O)=O |r|
n/an/an/a 1.17E+4n/an/an/a8.025
The University of Queensland
Assay Description
ITC measurements were conducted on a Microcal iTC200 (Malvern Instruments) in buffer consisting of 25 mM Tris (pH 8.0) and 100 mM NaCl. Proteins were...
Biochemistry 56: 2584-2593 (2017)
Article DOI: 10.1021/acs.biochem.7b00078
BindingDB Entry DOI: 10.7270/Q2QV3KD9
Activity Spreadsheet -- ITC Data from BindingDB
Found 2 hits for monomerid = 228840
Cell (A)Syringe (B)Cell
Syringe
Cell + Syr
ΔG°
kcal/mole
-TΔS°
kcal/mole
ΔH°
kcal/mole
log KpHTemp
°C
Na+/H+ exchanger regulatory factor-1 PDZ domain (PDZ1)
(Homo sapiens (Human))
BDBM228840
JPEG
(PTHRct-8 | QEEWETVM)
-6.693.85-10.67.93825
The University of Queensland
Biochemistry 56: 2584-2593 (2017)
Na+/H+ exchanger regulatory factor-1 PDZ domain (PDZ2)
(Homo sapiens (Human))
BDBM228840
JPEG
(PTHRct-8 | QEEWETVM)
-6.9314.7-21.68.01825
The University of Queensland
Biochemistry 56: 2584-2593 (2017)