BDBM22922 1-(2-hydroxy-1-phenylethyl)-1H-imidazole-4-carboxylic acid::imidazole-4-carboxylic acid compound, 4
SMILES: OCC(c1ccccc1)n1cnc(c1)C(O)=O
InChI Key: InChIKey=LPYQWWMMDQOAQT-UHFFFAOYSA-N
Data: 1 KI
Activity Spreadsheet -- Enzyme Inhibition Constant Data from BindingDB
Found 1 hit for monomerid = 22922
Trg + Lig
Ki
nM
ΔG°
kcal/mole
IC50
nM
Kd
nM
EC50/IC50
nM
koff
s-1
kon
M-1s-1
pHTemp
°C
Adenosine deaminase
(Homo sapiens (Human))
BDBM22922
(1-(2-hydroxy-1-phenylethyl)-1H-imidazole-4-carboxy...)
Show SMILES OCC(c1ccccc1)n1cnc(c1)C(O)=O
Show InChI InChI=1S/C12H12N2O3/c15-7-11(9-4-2-1-3-5-9)14-6-10(12(16)17)13-8-14/h1-6,8,11,15H,7H2,(H,16,17)
NCI pathway
Reactome pathway
>1.00E+5>-5.40n/an/an/an/an/a7.422
Fujisawa Pharmaceutical Co., Ltd.
Assay Description
The reaction velocity was measured by change in absorbance at 265nm (A265) resulting from the deamination of adenosine. The reaction was started by a...
Bioorg Med Chem Lett 13: 1115-8 (2003)
Article DOI: 10.1016/S0960-894X(03)00026-X
BindingDB Entry DOI: 10.7270/Q29Z936D