BDBM22937 1-[(2R)-4-{6-[(benzylcarbamoyl)amino]-1H-indol-1-yl}-1-hydroxybutan-2-yl]-1H-imidazole-4-carboxamide::Hybrid compound 1(FR235999) derivative, 5
SMILES: NC(=O)c1cn(cn1)[C@@H](CO)CCn1ccc2ccc(NC(=O)NCc3ccccc3)cc12
InChI Key: InChIKey=KCCUBLLGAMGDJL-HXUWFJFHSA-N
Data: 1 KI
PDB links: 1 PDB ID matches this monomer.
Activity Spreadsheet -- Enzyme Inhibition Constant Data from BindingDB
Found 1 hit for monomerid = 22937
Trg + Lig
Ki
nM
ΔG°
kcal/mole
IC50
nM
Kd
nM
EC50/IC50
nM
koff
s-1
kon
M-1s-1
pHTemp
°C
Adenosine deaminase
(Homo sapiens (Human))
BDBM22937
(1-[(2R)-4-{6-[(benzylcarbamoyl)amino]-1H-indol-1-y...)
Show SMILES NC(=O)c1cn(cn1)[C@@H](CO)CCn1ccc2ccc(NC(=O)NCc3ccccc3)cc12 |r|
Show InChI InChI=1S/C24H26N6O3/c25-23(32)21-14-30(16-27-21)20(15-31)9-11-29-10-8-18-6-7-19(12-22(18)29)28-24(33)26-13-17-4-2-1-3-5-17/h1-8,10,12,14,16,20,31H,9,11,13,15H2,(H2,25,32)(H2,26,28,33)/t20-/m1/s1
NCI pathway
Reactome pathway
7.5 -11.0n/an/an/an/an/a7.422
Fujisawa Pharmaceutical Co., Ltd.
Assay Description
The reaction velocity was measured by change in absorbance at 265nm (A265) resulting from the deamination of adenosine. The reaction was started by a...
J Med Chem 47: 3730-43 (2004)
Article DOI: 10.1021/jm0306374
BindingDB Entry DOI: 10.7270/Q2668BG0
3D
3D Structure (crystal)