BDBM22946 1-[(2R)-4-[5-(hexyloxy)-1-methyl-1H-indol-3-yl]-1-hydroxybutan-2-yl]-1H-imidazole-4-carboxamide::Hybrid compound 1(FR235999) derivative, 8b
SMILES: CCCCCCOc1ccc2n(C)cc(CC[C@H](CO)n3cnc(c3)C(N)=O)c2c1
InChI Key: InChIKey=QBDQBFOJTONVKG-GOSISDBHSA-N
Data: 1 KI
Activity Spreadsheet -- Enzyme Inhibition Constant Data from BindingDB
Found 1 hit for monomerid = 22946
Trg + Lig
Ki
nM
ΔG°
kcal/mole
IC50
nM
Kd
nM
EC50/IC50
nM
koff
s-1
kon
M-1s-1
pHTemp
°C
Adenosine deaminase
(Homo sapiens (Human))
BDBM22946
(1-[(2R)-4-[5-(hexyloxy)-1-methyl-1H-indol-3-yl]-1-...)
Show SMILES CCCCCCOc1ccc2n(C)cc(CC[C@H](CO)n3cnc(c3)C(N)=O)c2c1 |r|
Show InChI InChI=1S/C23H32N4O3/c1-3-4-5-6-11-30-19-9-10-22-20(12-19)17(13-26(22)2)7-8-18(15-28)27-14-21(23(24)29)25-16-27/h9-10,12-14,16,18,28H,3-8,11,15H2,1-2H3,(H2,24,29)/t18-/m1/s1
NCI pathway
Reactome pathway
13 -10.6n/an/an/an/an/a7.422
Fujisawa Pharmaceutical Co., Ltd.
Assay Description
The reaction velocity was measured by change in absorbance at 265nm (A265) resulting from the deamination of adenosine. The reaction was started by a...
J Med Chem 47: 3730-43 (2004)
Article DOI: 10.1021/jm0306374
BindingDB Entry DOI: 10.7270/Q2668BG0