BDBM23058 3-{7-oxo-7-[5-(pyridin-2-yl)-1,3-oxazol-2-yl]heptyl}benzoic acid::CHEMBL229592::alpha-ketooxazole, 5ee
SMILES: OC(=O)c1cccc(CCCCCCC(=O)c2ncc(o2)-c2ccccn2)c1
InChI Key: InChIKey=SQVFAGRJQCCLCB-UHFFFAOYSA-N
Data: 2 KI
Activity Spreadsheet -- Enzyme Inhibition Constant Data from BindingDB
Found 2 hits for monomerid = 23058
Trg + Lig
Ki
nM
ΔG°
kcal/mole
IC50
nM
Kd
nM
EC50/IC50
nM
koff
s-1
kon
M-1s-1
pHTemp
°C
Fatty-acid amide hydrolase 1
(Homo sapiens (Human))
BDBM23058
(3-{7-oxo-7-[5-(pyridin-2-yl)-1,3-oxazol-2-yl]hepty...)
Show SMILES OC(=O)c1cccc(CCCCCCC(=O)c2ncc(o2)-c2ccccn2)c1
Show InChI InChI=1S/C22H22N2O4/c25-19(21-24-15-20(28-21)18-11-5-6-13-23-18)12-4-2-1-3-8-16-9-7-10-17(14-16)22(26)27/h5-7,9-11,13-15H,1-4,8,12H2,(H,26,27)
>600n/an/an/an/an/an/an/an/a
Johnson& Johnson Pharmaceutical Research and Development
Curated by ChEMBL
Assay Description
Inhibition of FAAH
J Med Chem 51: 7327-43 (2009)
Article DOI: 10.1021/jm800311k
BindingDB Entry DOI: 10.7270/Q2J67HT8
Fatty Acid Amide Hydrolase
(Homo sapiens (Human))
BDBM23058
(3-{7-oxo-7-[5-(pyridin-2-yl)-1,3-oxazol-2-yl]hepty...)
Show SMILES OC(=O)c1cccc(CCCCCCC(=O)c2ncc(o2)-c2ccccn2)c1
Show InChI InChI=1S/C22H22N2O4/c25-19(21-24-15-20(28-21)18-11-5-6-13-23-18)12-4-2-1-3-8-16-9-7-10-17(14-16)22(26)27/h5-7,9-11,13-15H,1-4,8,12H2,(H,26,27)
Reactome pathway
>600>-8.48n/an/an/an/an/an/a25
The Scripps Research Institute
Assay Description
The inhibition assays were performed by incubating enzyme, 14C-labeled oleamide in reaction buffer at room temperature in the presence of three diffe...
J Med Chem 50: 3359-68 (2007)
Article DOI: 10.1021/jm061414r
BindingDB Entry DOI: 10.7270/Q2DR2SSH