null
SMILES: [H][C@@]12[C@@H](C)OC(=O)[C@@]1(CC(F)(F)[C@@]([H])(C)[C@@H]2\C=C\c1ccc(cn1)-c1ccccc1C#N)NCc1cncs1
InChI Key: InChIKey=CGRHZEBKDQQLCB-VFHGMRLFSA-N
Activity Spreadsheet -- Enzyme Inhibition Constant Data from BindingDB
Found 1 hit for monomerid = 230708
Trg + Lig
Ki
nM
ΔG°
kcal/mole
IC50
nM
Kd
nM
EC50/IC50
nM
koff
s-1
kon
M-1s-1
pHTemp
°C
Proteinase-activated receptor 1
(Homo sapiens (Human))
BDBM230708
(US9340530, 43)
Show SMILES [H][C@@]12[C@@H](C)OC(=O)[C@@]1(CC(F)(F)[C@@]([H])(C)[C@@H]2\C=C\c1ccc(cn1)-c1ccccc1C#N)NCc1cncs1 |r|
Show InChI InChI=1S/C28H26F2N4O2S/c1-17-23(10-9-21-8-7-20(12-33-21)24-6-4-3-5-19(24)11-31)25-18(2)36-26(35)27(25,15-28(17,29)30)34-14-22-13-32-16-37-22/h3-10,12-13,16-18,23,25,34H,14-15H2,1-2H3/b10-9+/t17-,18+,23-,25-,27-/m0/s1
US Patent
n/an/a 1.30n/an/an/an/an/an/a
Merck Sharp & Dohme Corp.
US Patent
Assay Description
HEK 293 Cells were grown in media containing DMEM, 10% FBS pen/strep/L-Glutamine and non-essential amino acids. The cells were plated in 384-well PDL...
US Patent US9340530 (2016)
BindingDB Entry DOI: 10.7270/Q2K35SJH