BDBM230724 US9340530, 59
SMILES: [H][C@@]12[C@@H](C)OC(=O)[C@@]1(CC(F)(F)[C@@]([H])(C)[C@@H]2\C=C\c1ccc(cn1)-c1ccccc1C#N)NC(=O)c1ccc(Cl)nc1
InChI Key: InChIKey=VLUDWCTUXSVJNN-QHIIWBCQSA-N
Data: 1 IC50
Activity Spreadsheet -- Enzyme Inhibition Constant Data from BindingDB
Found 1 hit for monomerid = 230724
Trg + Lig
Ki
nM
ΔG°
kcal/mole
IC50
nM
Kd
nM
EC50/IC50
nM
koff
s-1
kon
M-1s-1
pHTemp
°C
Proteinase-activated receptor 1
(Homo sapiens (Human))
BDBM230724
(US9340530, 59)
Show SMILES [H][C@@]12[C@@H](C)OC(=O)[C@@]1(CC(F)(F)[C@@]([H])(C)[C@@H]2\C=C\c1ccc(cn1)-c1ccccc1C#N)NC(=O)c1ccc(Cl)nc1 |r|
Show InChI InChI=1S/C30H25ClF2N4O3/c1-17-23(11-10-22-9-7-20(14-35-22)24-6-4-3-5-19(24)13-34)26-18(2)40-28(39)29(26,16-30(17,32)33)37-27(38)21-8-12-25(31)36-15-21/h3-12,14-15,17-18,23,26H,16H2,1-2H3,(H,37,38)/b11-10+/t17-,18+,23-,26-,29-/m0/s1
US Patent
n/an/a 3n/an/an/an/an/an/a
Merck Sharp & Dohme Corp.
US Patent
Assay Description
HEK 293 Cells were grown in media containing DMEM, 10% FBS pen/strep/L-Glutamine and non-essential amino acids. The cells were plated in 384-well PDL...
US Patent US9340530 (2016)
BindingDB Entry DOI: 10.7270/Q2K35SJH