null
SMILES: [H][C@@]12[C@@H](C)OC(=O)[C@@]1(CC(F)(F)[C@@]([H])(C)[C@@H]2\C=C\c1ccc(cn1)-c1ccccc1C#N)NC(=O)C1CC1
InChI Key: InChIKey=MFNXKFBQBXRKIP-CLJSJWOASA-N
Activity Spreadsheet -- Enzyme Inhibition Constant Data from BindingDB
Found 1 hit for monomerid = 230731
Trg + Lig
Ki
nM
ΔG°
kcal/mole
IC50
nM
Kd
nM
EC50/IC50
nM
koff
s-1
kon
M-1s-1
pHTemp
°C
Proteinase-activated receptor 1
(Homo sapiens (Human))
BDBM230731
(US9340530, 66)
Show SMILES [H][C@@]12[C@@H](C)OC(=O)[C@@]1(CC(F)(F)[C@@]([H])(C)[C@@H]2\C=C\c1ccc(cn1)-c1ccccc1C#N)NC(=O)C1CC1 |r|
Show InChI InChI=1S/C28H27F2N3O3/c1-16-22(12-11-21-10-9-20(14-32-21)23-6-4-3-5-19(23)13-31)24-17(2)36-26(35)27(24,15-28(16,29)30)33-25(34)18-7-8-18/h3-6,9-12,14,16-18,22,24H,7-8,15H2,1-2H3,(H,33,34)/b12-11+/t16-,17+,22-,24-,27-/m0/s1
US Patent
n/an/a 3.5n/an/an/an/an/an/a
Merck Sharp & Dohme Corp.
US Patent
Assay Description
HEK 293 Cells were grown in media containing DMEM, 10% FBS pen/strep/L-Glutamine and non-essential amino acids. The cells were plated in 384-well PDL...
US Patent US9340530 (2016)
BindingDB Entry DOI: 10.7270/Q2K35SJH