BDBM230904 US10188642, Example 30::US9334286, 30
SMILES: COc1cc(ccc1Nc1cc2cc(ccc2cn1)-c1cnn(CC2(C)COC2)c1)-c1cnc(C)n1C
InChI Key: InChIKey=PJFRJNQKQZKKKJ-UHFFFAOYSA-N
Data: 2 IC50
Activity Spreadsheet -- Enzyme Inhibition Constant Data from BindingDB
Found 2 hits for monomerid = 230904
Trg + Lig
Ki
nM
ΔG°
kcal/mole
IC50
nM
Kd
nM
EC50/IC50
nM
koff
s-1
kon
M-1s-1
pHTemp
°C
Dual specificity protein kinase TTK
(Homo sapiens (Human))
BDBM230904
(US10188642, Example 30 | US9334286, 30)
Show SMILES COc1cc(ccc1Nc1cc2cc(ccc2cn1)-c1cnn(CC2(C)COC2)c1)-c1cnc(C)n1C
Show InChI InChI=1S/C29H30N6O2/c1-19-30-14-26(34(19)3)21-7-8-25(27(10-21)36-4)33-28-11-23-9-20(5-6-22(23)12-31-28)24-13-32-35(15-24)16-29(2)17-37-18-29/h5-15H,16-18H2,1-4H3,(H,31,33)
US Patent
n/an/a 2n/an/an/an/an/an/a
Cancer Research Technology Limited
US Patent
Assay Description
The enzyme reaction (total volume 10 μl) was carried out in black 384-well low volume plates containing full length MPS1 (12.5 nM or 3 nM), fluo...
US Patent US10188642 (2019)
BindingDB Entry DOI: 10.7270/Q2D50Q2N
Dual specificity protein kinase TTK
(Homo sapiens (Human))
BDBM230904
(US10188642, Example 30 | US9334286, 30)
Show SMILES COc1cc(ccc1Nc1cc2cc(ccc2cn1)-c1cnn(CC2(C)COC2)c1)-c1cnc(C)n1C
Show InChI InChI=1S/C29H30N6O2/c1-19-30-14-26(34(19)3)21-7-8-25(27(10-21)36-4)33-28-11-23-9-20(5-6-22(23)12-31-28)24-13-32-35(15-24)16-29(2)17-37-18-29/h5-15H,16-18H2,1-4H3,(H,31,33)
US Patent
n/an/a 2n/an/an/an/a7.025
Cancer Research Technology Limited
US Patent
Assay Description
The enzyme reaction (total volume 10 μl) was carried out in black 384-well low volume plates containing full length MPS1 (12.5 nM or 3 nM), fluo...
US Patent US9334286 (2016)
BindingDB Entry DOI: 10.7270/Q2GB22X3