BDBM230907 US10188642, Example 33::US9334286, 33
SMILES: COc1cc(ccc1Nc1cc2cc(ccc2cn1)-c1cnn(c1)C1COC1)-c1cnc(C)n1C
InChI Key: InChIKey=QWLNKOQNIMMUSB-UHFFFAOYSA-N
Data: 2 IC50
Activity Spreadsheet -- Enzyme Inhibition Constant Data from BindingDB
Found 2 hits for monomerid = 230907
Trg + Lig
Ki
nM
ΔG°
kcal/mole
IC50
nM
Kd
nM
EC50/IC50
nM
koff
s-1
kon
M-1s-1
pHTemp
°C
Dual specificity protein kinase TTK
(Homo sapiens (Human))
BDBM230907
(US10188642, Example 33 | US9334286, 33)
Show SMILES COc1cc(ccc1Nc1cc2cc(ccc2cn1)-c1cnn(c1)C1COC1)-c1cnc(C)n1C
Show InChI InChI=1S/C27H26N6O2/c1-17-28-13-25(32(17)2)19-6-7-24(26(9-19)34-3)31-27-10-21-8-18(4-5-20(21)11-29-27)22-12-30-33(14-22)23-15-35-16-23/h4-14,23H,15-16H2,1-3H3,(H,29,31)
US Patent
n/an/a 3n/an/an/an/an/an/a
Cancer Research Technology Limited
US Patent
Assay Description
The enzyme reaction (total volume 10 μl) was carried out in black 384-well low volume plates containing full length MPS1 (12.5 nM or 3 nM), fluo...
US Patent US10188642 (2019)
BindingDB Entry DOI: 10.7270/Q2D50Q2N
Dual specificity protein kinase TTK
(Homo sapiens (Human))
BDBM230907
(US10188642, Example 33 | US9334286, 33)
Show SMILES COc1cc(ccc1Nc1cc2cc(ccc2cn1)-c1cnn(c1)C1COC1)-c1cnc(C)n1C
Show InChI InChI=1S/C27H26N6O2/c1-17-28-13-25(32(17)2)19-6-7-24(26(9-19)34-3)31-27-10-21-8-18(4-5-20(21)11-29-27)22-12-30-33(14-22)23-15-35-16-23/h4-14,23H,15-16H2,1-3H3,(H,29,31)
US Patent
n/an/a 3n/an/an/an/a7.025
Cancer Research Technology Limited
US Patent
Assay Description
The enzyme reaction (total volume 10 μl) was carried out in black 384-well low volume plates containing full length MPS1 (12.5 nM or 3 nM), fluo...
US Patent US9334286 (2016)
BindingDB Entry DOI: 10.7270/Q2GB22X3