null
SMILES: CCOc1cc(ccc1Nc1cc2nc(ccc2cn1)-c1cnn(CC(C)(C)O)c1)-c1nncn1C
InChI Key: InChIKey=MHHKAXZAQKJTKT-UHFFFAOYSA-N
Activity Spreadsheet -- Enzyme Inhibition Constant Data from BindingDB
Found 2 hits for monomerid = 230976
Trg + Lig
Ki
nM
ΔG°
kcal/mole
IC50
nM
Kd
nM
EC50/IC50
nM
koff
s-1
kon
M-1s-1
pHTemp
°C
Dual specificity protein kinase TTK
(Homo sapiens (Human))
BDBM230976
(US10188642, Example 103 | US9334286, 103)
Show SMILES CCOc1cc(ccc1Nc1cc2nc(ccc2cn1)-c1cnn(CC(C)(C)O)c1)-c1nncn1C
Show InChI InChI=1S/C26H28N8O2/c1-5-36-23-10-17(25-32-28-16-33(25)4)6-9-21(23)31-24-11-22-18(12-27-24)7-8-20(30-22)19-13-29-34(14-19)15-26(2,3)35/h6-14,16,35H,5,15H2,1-4H3,(H,27,31)
US Patent
n/an/a 1n/an/an/an/an/an/a
Cancer Research Technology Limited
US Patent
Assay Description
The enzyme reaction (total volume 10 μl) was carried out in black 384-well low volume plates containing full length MPS1 (12.5 nM or 3 nM), fluo...
US Patent US10188642 (2019)
BindingDB Entry DOI: 10.7270/Q2D50Q2N
Dual specificity protein kinase TTK
(Homo sapiens (Human))
BDBM230976
(US10188642, Example 103 | US9334286, 103)
Show SMILES CCOc1cc(ccc1Nc1cc2nc(ccc2cn1)-c1cnn(CC(C)(C)O)c1)-c1nncn1C
Show InChI InChI=1S/C26H28N8O2/c1-5-36-23-10-17(25-32-28-16-33(25)4)6-9-21(23)31-24-11-22-18(12-27-24)7-8-20(30-22)19-13-29-34(14-19)15-26(2,3)35/h6-14,16,35H,5,15H2,1-4H3,(H,27,31)
US Patent
n/an/a 1n/an/an/an/a7.025
Cancer Research Technology Limited
US Patent
Assay Description
The enzyme reaction (total volume 10 μl) was carried out in black 384-well low volume plates containing full length MPS1 (12.5 nM or 3 nM), fluo...
US Patent US9334286 (2016)
BindingDB Entry DOI: 10.7270/Q2GB22X3