BDBM2315 6-(1-phenylethyl)-2-(propan-2-ylsulfanyl)-3,4-dihydropyrimidin-4-one::S-DABO::thio-DABO 3a
SMILES: CC(C)Sc1nc(cc(=O)[nH]1)C(C)c1ccccc1
InChI Key: InChIKey=KKMFFHPURCAYNN-UHFFFAOYSA-N
Data: 1 IC50
Activity Spreadsheet -- Enzyme Inhibition Constant Data from BindingDB
Found 1 hit for monomerid = 2315
Trg + Lig
Ki
nM
ΔG°
kcal/mole
IC50
nM
Kd
nM
EC50/IC50
nM
koff
s-1
kon
M-1s-1
pHTemp
°C
HIV-1 Reverse Transcriptase
(Human immunodeficiency virus type 1)
BDBM2315
(6-(1-phenylethyl)-2-(propan-2-ylsulfanyl)-3,4-dihy...)
Show SMILES CC(C)Sc1nc(cc(=O)[nH]1)C(C)c1ccccc1
Show InChI InChI=1S/C15H18N2OS/c1-10(2)19-15-16-13(9-14(18)17-15)11(3)12-7-5-4-6-8-12/h4-11H,1-3H3,(H,16,17,18)
n/an/a 2.30E+3n/an/an/an/a7.837
Universita degli Studi di Roma La Sapienza
Assay Description
The IC50 of reverse transcriptase is the concentration that inhibits 50% of recombinant HIV-1 RT RNA-directed DNA polymerase activity in vitro.
J Med Chem 44: 2544-54 (2001)
Article DOI: 10.1021/jm010853h
BindingDB Entry DOI: 10.7270/Q2CN724V