null
SMILES: Fc1ccc(CN2CCC(CCN3C(=O)c4cc5OCOc5cc4C3=O)CC2)cc1
InChI Key: InChIKey=UWRMLURMWNLEFO-UHFFFAOYSA-N
Activity Spreadsheet -- Enzyme Inhibition Constant Data from BindingDB
Found 1 hit for monomerid = 231519
Trg + Lig
Ki
nM
ΔG°
kcal/mole
IC50
nM
Kd
nM
EC50/IC50
nM
koff
s-1
kon
M-1s-1
pHTemp
°C
Acetylcholinesterase
(Mus musculus (mouse))
BDBM231519
(US9346818, I-4)
Show SMILES Fc1ccc(CN2CCC(CCN3C(=O)c4cc5OCOc5cc4C3=O)CC2)cc1
Show InChI InChI=1S/C23H23FN2O4/c24-17-3-1-16(2-4-17)13-25-8-5-15(6-9-25)7-10-26-22(27)18-11-20-21(30-14-29-20)12-19(18)23(26)28/h1-4,11-12,15H,5-10,13-14H2
Reactome pathway
US Patent
n/an/a 167n/an/an/an/an/an/a
Zhejiang Hisun Pharmaceutical Co., Ltd.
US Patent
Assay Description
Modified Ellman method (Alvin V. et al. JWS-USC-75-IX Improves Information Processing and Cognitive Function in Animal Models[J]. Journal of Pharmaco...
US Patent US9346818 (2016)
BindingDB Entry DOI: 10.7270/Q2WD3ZFC