null
SMILES: [O-][N+](=O)c1ccc2o[nH]c(=O)c2c1
InChI Key: InChIKey=NPKARQNMFDJQQO-UHFFFAOYSA-N
Activity Spreadsheet -- Enzyme Inhibition Constant Data from BindingDB
Found 1 hit for monomerid = 23172
Trg + Lig
Ki
nM
ΔG°
kcal/mole
IC50
nM
Kd
nM
EC50/IC50
nM
koff
s-1
kon
M-1s-1
pHTemp
°C
D-amino-acid oxidase
(Sus scrofa (pig))
BDBM23172
(5-nitro-1,2-benzoxazol-3-ol | Benzo[d]isoxazol-3-o...)
Show SMILES [O-][N+](=O)c1ccc2o[nH]c(=O)c2c1
Show InChI InChI=1S/C7H4N2O4/c10-7-5-3-4(9(11)12)1-2-6(5)13-8-7/h1-3H,(H,8,10)
Reactome pathway
n/an/a 2.95E+3n/an/an/an/a8.522
MGI Pharma
Assay Description
D-amino acid oxidase (DAAO) was assayed in a 96-well plate format. D-serine was oxidatively deaminated by porcine D-amino acid oxidase in the presenc...
J Med Chem 51: 3357-9 (2008)
Article DOI: 10.1021/jm800200u
BindingDB Entry DOI: 10.7270/Q21G0JJJ