BDBM2319 2-(cyclohexylsulfanyl)-6-[1-(naphthalen-1-yl)ethyl]-3,4-dihydropyrimidin-4-one::S-DABO::thio-DABO 3g
SMILES: CC(c1cc(=O)[nH]c(SC2CCCCC2)n1)c1cccc2ccccc12
InChI Key: InChIKey=WUTDUYRUVOILRH-UHFFFAOYSA-N
Data: 1 IC50
Activity Spreadsheet -- Enzyme Inhibition Constant Data from BindingDB
Found 1 hit for monomerid = 2319
Trg + Lig
Ki
nM
ΔG°
kcal/mole
IC50
nM
Kd
nM
EC50/IC50
nM
koff
s-1
kon
M-1s-1
pHTemp
°C
HIV-1 Reverse Transcriptase
(Human immunodeficiency virus type 1)
BDBM2319
(2-(cyclohexylsulfanyl)-6-[1-(naphthalen-1-yl)ethyl...)
Show SMILES CC(c1cc(=O)[nH]c(SC2CCCCC2)n1)c1cccc2ccccc12
Show InChI InChI=1S/C22H24N2OS/c1-15(18-13-7-9-16-8-5-6-12-19(16)18)20-14-21(25)24-22(23-20)26-17-10-3-2-4-11-17/h5-9,12-15,17H,2-4,10-11H2,1H3,(H,23,24,25)
n/an/a 2.60E+3n/an/an/an/a7.837
Universita degli Studi di Roma La Sapienza
Assay Description
The IC50 of reverse transcriptase is the concentration that inhibits 50% of recombinant HIV-1 RT RNA-directed DNA polymerase activity in vitro.
J Med Chem 44: 2544-54 (2001)
Article DOI: 10.1021/jm010853h
BindingDB Entry DOI: 10.7270/Q2CN724V