BDBM232232 N-2,3,6-trifluorobenzoyl-L-leucine-glycine nitrile (28)
SMILES: CC(C)C[C@H](NC(=O)c1c(F)ccc(F)c1F)C(=O)NCC#N
InChI Key: InChIKey=SULLJNJKNHPABG-NSHDSACASA-N
Data: 1 IC50
Activity Spreadsheet -- Enzyme Inhibition Constant Data from BindingDB
Found 1 hit for monomerid = 232232
Trg + Lig
Ki
nM
ΔG°
kcal/mole
IC50
nM
Kd
nM
EC50/IC50
nM
koff
s-1
kon
M-1s-1
pHTemp
°C
Cathepsin L1 (CL1)
(Fasciola hepatica (Liver fluke))
BDBM232232
(N-2,3,6-trifluorobenzoyl-L-leucine-glycine nitrile...)
Show SMILES CC(C)C[C@H](NC(=O)c1c(F)ccc(F)c1F)C(=O)NCC#N |r|
Show InChI InChI=1S/C15H16F3N3O2/c1-8(2)7-11(14(22)20-6-5-19)21-15(23)12-9(16)3-4-10(17)13(12)18/h3-4,8,11H,6-7H2,1-2H3,(H,20,22)(H,21,23)/t11-/m0/s1
n/an/a 6.00E+3n/an/an/an/an/an/a
Dublin City University
Assay Description
The protease was activated by the addition of dithiothreitol, ethylenediaminetetraacetic acid (EDTA), and sodium acetate followed by incubation at 37...
J Enzyme Inhib Med Chem 25: 1-12 (2010)
Article DOI: 10.3109/14756360902888184
BindingDB Entry DOI: 10.7270/Q29G5KP4