BDBM232246 US9345742, 4
SMILES: CC[C@H](C)[C@H](NC(=O)C[C@H](N)[C@H](Cc1ccccc1)NC(=O)[C@H](CC)NC(=O)[C@H](CC(C)C)NC(=O)CC(C)C)C(=O)N[C@@H](C(C)C)C(=O)OC
InChI Key: InChIKey=RWMPDCHUPLPJKG-LQVOJWAVSA-N
Data: 1 IC50
Activity Spreadsheet -- Enzyme Inhibition Constant Data from BindingDB
Found 1 hit for monomerid = 232246
Trg + Lig
Ki
nM
ΔG°
kcal/mole
IC50
nM
Kd
nM
EC50/IC50
nM
koff
s-1
kon
M-1s-1
pHTemp
°C
Cathepsin D
(Homo sapiens (Human))
BDBM232246
(US9345742, 4)
Show SMILES CC[C@H](C)[C@H](NC(=O)C[C@H](N)[C@H](Cc1ccccc1)NC(=O)[C@H](CC)NC(=O)[C@H](CC(C)C)NC(=O)CC(C)C)C(=O)N[C@@H](C(C)C)C(=O)OC |r|
Show InChI InChI=1S/C38H64N6O7/c1-11-25(9)34(37(49)44-33(24(7)8)38(50)51-10)43-32(46)21-27(39)29(20-26-16-14-13-15-17-26)42-35(47)28(12-2)41-36(48)30(18-22(3)4)40-31(45)19-23(5)6/h13-17,22-25,27-30,33-34H,11-12,18-21,39H2,1-10H3,(H,40,45)(H,41,48)(H,42,47)(H,43,46)(H,44,49)/t25-,27-,28-,29-,30-,33-,34-/m0/s1
NCI pathway
Reactome pathway
US Patent
n/an/a 97n/an/an/an/a5.525
MERCK PATENT GMBH
US Patent
Assay Description
In order to identify modulators of cathepsin D activity, a continuous enzymatic test was carried out with a synthetic peptide which carries a fluores...
US Patent US9345742 (2016)
BindingDB Entry DOI: 10.7270/Q25Q4TZD