BDBM2324 2-(butan-2-ylsulfanyl)-6-[1-(2,6-difluorophenyl)ethyl]-5-methyl-3,4-dihydropyrimidin-4-one::S-DABO::thio-DABO 3t
SMILES: CCC(C)Sc1nc(C(C)c2c(F)cccc2F)c(C)c(=O)[nH]1
InChI Key: InChIKey=QIUAPKYBHDKVCU-UHFFFAOYSA-N
Data: 1 IC50
Activity Spreadsheet -- Enzyme Inhibition Constant Data from BindingDB
Found 1 hit for monomerid = 2324
Trg + Lig
Ki
nM
ΔG°
kcal/mole
IC50
nM
Kd
nM
EC50/IC50
nM
koff
s-1
kon
M-1s-1
pHTemp
°C
HIV-1 Reverse Transcriptase
(Human immunodeficiency virus type 1)
BDBM2324
(2-(butan-2-ylsulfanyl)-6-[1-(2,6-difluorophenyl)et...)
Show SMILES CCC(C)Sc1nc(C(C)c2c(F)cccc2F)c(C)c(=O)[nH]1
Show InChI InChI=1S/C17H20F2N2OS/c1-5-9(2)23-17-20-15(11(4)16(22)21-17)10(3)14-12(18)7-6-8-13(14)19/h6-10H,5H2,1-4H3,(H,20,21,22)
n/an/a 20n/an/an/an/a7.837
Universita degli Studi di Roma La Sapienza
Assay Description
The IC50 of reverse transcriptase is the concentration that inhibits 50% of recombinant HIV-1 RT RNA-directed DNA polymerase activity in vitro.
J Med Chem 44: 2544-54 (2001)
Article DOI: 10.1021/jm010853h
BindingDB Entry DOI: 10.7270/Q2CN724V