BDBM232576 US9346815, 122::US9604984, Example 122
SMILES: CN(Cc1cccc(Br)c1)C1CCN(CC1)C(=O)Cn1cc(NC(=O)c2cnn3cccnc23)c(n1)-c1cc(Cl)ccc1OC(F)F
InChI Key: InChIKey=YTSUOQJODCDYIB-UHFFFAOYSA-N
Data: 4 KI
Activity Spreadsheet -- Enzyme Inhibition Constant Data from BindingDB
Found 4 hits for monomerid = 232576
Trg + Lig
Ki
nM
ΔG°
kcal/mole
IC50
nM
Kd
nM
EC50/IC50
nM
koff
s-1
kon
M-1s-1
pHTemp
°C
Tyrosine-protein kinase JAK2
(Homo sapiens (Human))
BDBM232576
(US9346815, 122 | US9604984, Example 122)
Show SMILES CN(Cc1cccc(Br)c1)C1CCN(CC1)C(=O)Cn1cc(NC(=O)c2cnn3cccnc23)c(n1)-c1cc(Cl)ccc1OC(F)F
Show InChI InChI=1S/C32H30BrClF2N8O3/c1-41(17-20-4-2-5-21(33)14-20)23-8-12-42(13-9-23)28(45)19-43-18-26(39-31(46)25-16-38-44-11-3-10-37-30(25)44)29(40-43)24-15-22(34)6-7-27(24)47-32(35)36/h2-7,10-11,14-16,18,23,32H,8-9,12-13,17,19H2,1H3,(H,39,46)
Reactome pathway
US Patent
0.170 -13.2n/an/an/an/an/a7.222
Genentech, Inc.
US Patent
Assay Description
The activity of the isolated recombinant JAK1 and JAK2 kinase domain was measured by monitoring phosphorylation of a peptide derived from JAK3 (Val-A...
US Patent US9346815 (2016)
BindingDB Entry DOI: 10.7270/Q2NS0SRT
Tyrosine-protein kinase JAK2
(Homo sapiens (Human))
BDBM232576
(US9346815, 122 | US9604984, Example 122)
Show SMILES CN(Cc1cccc(Br)c1)C1CCN(CC1)C(=O)Cn1cc(NC(=O)c2cnn3cccnc23)c(n1)-c1cc(Cl)ccc1OC(F)F
Show InChI InChI=1S/C32H30BrClF2N8O3/c1-41(17-20-4-2-5-21(33)14-20)23-8-12-42(13-9-23)28(45)19-43-18-26(39-31(46)25-16-38-44-11-3-10-37-30(25)44)29(40-43)24-15-22(34)6-7-27(24)47-32(35)36/h2-7,10-11,14-16,18,23,32H,8-9,12-13,17,19H2,1H3,(H,39,46)
Reactome pathway
US Patent
0.170n/an/an/an/an/an/an/an/a
Genentech, Inc.
US Patent
Assay Description
The activity of the isolated recombinant JAK1 and JAK2 kinase domain was measured by monitoring phosphorylation of a peptide derived from JAK3 (Val-A...
US Patent US9604984 (2017)
BindingDB Entry DOI: 10.7270/Q26D5W25
Tyrosine-protein kinase JAK1
(Homo sapiens (Human))
BDBM232576
(US9346815, 122 | US9604984, Example 122)
Show SMILES CN(Cc1cccc(Br)c1)C1CCN(CC1)C(=O)Cn1cc(NC(=O)c2cnn3cccnc23)c(n1)-c1cc(Cl)ccc1OC(F)F
Show InChI InChI=1S/C32H30BrClF2N8O3/c1-41(17-20-4-2-5-21(33)14-20)23-8-12-42(13-9-23)28(45)19-43-18-26(39-31(46)25-16-38-44-11-3-10-37-30(25)44)29(40-43)24-15-22(34)6-7-27(24)47-32(35)36/h2-7,10-11,14-16,18,23,32H,8-9,12-13,17,19H2,1H3,(H,39,46)
Reactome pathway
US Patent
0.270n/an/an/an/an/an/an/an/a
Genentech, Inc.
US Patent
Assay Description
The activity of the isolated recombinant JAK1 and JAK2 kinase domain was measured by monitoring phosphorylation of a peptide derived from JAK3 (Val-A...
US Patent US9604984 (2017)
BindingDB Entry DOI: 10.7270/Q26D5W25
Tyrosine-protein kinase JAK1
(Homo sapiens (Human))
BDBM232576
(US9346815, 122 | US9604984, Example 122)
Show SMILES CN(Cc1cccc(Br)c1)C1CCN(CC1)C(=O)Cn1cc(NC(=O)c2cnn3cccnc23)c(n1)-c1cc(Cl)ccc1OC(F)F
Show InChI InChI=1S/C32H30BrClF2N8O3/c1-41(17-20-4-2-5-21(33)14-20)23-8-12-42(13-9-23)28(45)19-43-18-26(39-31(46)25-16-38-44-11-3-10-37-30(25)44)29(40-43)24-15-22(34)6-7-27(24)47-32(35)36/h2-7,10-11,14-16,18,23,32H,8-9,12-13,17,19H2,1H3,(H,39,46)
Reactome pathway
US Patent
0.270 -12.9n/an/an/an/an/a7.222
Genentech, Inc.
US Patent
Assay Description
The activity of the isolated recombinant JAK1 and JAK2 kinase domain was measured by monitoring phosphorylation of a peptide derived from JAK3 (Val-A...
US Patent US9346815 (2016)
BindingDB Entry DOI: 10.7270/Q2NS0SRT