BDBM2327 2-(cyclopentylsulfanyl)-6-(1-phenylpropyl)-3,4-dihydropyrimidin-4-one::S-DABO::thio-DABO 3cc
SMILES: CCC(c1ccccc1)c1cc(=O)[nH]c(SC2CCCC2)n1
InChI Key: InChIKey=PLHYYYWOVPEETM-UHFFFAOYSA-N
Data: 1 IC50
Activity Spreadsheet -- Enzyme Inhibition Constant Data from BindingDB
Found 1 hit for monomerid = 2327
Trg + Lig
Ki
nM
ΔG°
kcal/mole
IC50
nM
Kd
nM
EC50/IC50
nM
koff
s-1
kon
M-1s-1
pHTemp
°C
HIV-1 Reverse Transcriptase
(Human immunodeficiency virus type 1)
BDBM2327
(2-(cyclopentylsulfanyl)-6-(1-phenylpropyl)-3,4-dih...)
Show SMILES CCC(c1ccccc1)c1cc(=O)[nH]c(SC2CCCC2)n1
Show InChI InChI=1S/C18H22N2OS/c1-2-15(13-8-4-3-5-9-13)16-12-17(21)20-18(19-16)22-14-10-6-7-11-14/h3-5,8-9,12,14-15H,2,6-7,10-11H2,1H3,(H,19,20,21)
n/an/a>1.00E+4n/an/an/an/a7.837
Universita degli Studi di Roma La Sapienza
Assay Description
The IC50 of reverse transcriptase is the concentration that inhibits 50% of recombinant HIV-1 RT RNA-directed DNA polymerase activity in vitro.
J Med Chem 44: 2544-54 (2001)
Article DOI: 10.1021/jm010853h
BindingDB Entry DOI: 10.7270/Q2CN724V